program: Gaussian 09
title: 000053422
version: EM64L-G09RevD.01
frameworkgroup: C1[X(C19H30O7)]
method: RPBEPBE
basis: SDD
operation: Freq
keyword: #pfreq=noraman
keyword: PBEPBE/SDD
title: #p freq=noraman PBEPBE/SDD
converged: YES YES NO NO
title: Mulliken charges:
elementType: O O O O O O O C C C C C C C C C C C C C C C C C C C H H H H H H H H H H H H H H H H H H H H H H H H H H H H H H
charge: -0.185294 -0.239261 -0.246867 -0.187634 -0.231542 -0.393856 -0.278374 0.150608 -0.045256 -0.149762 -0.010202 -0.110995 -0.186036 -0.504391 -0.496828 -0.450318 -0.075314 0.323920 -0.460264 -0.753017 -0.786342 -0.407287 -0.736652 -0.402429 -0.310627 0.274965 0.224844 0.244763 0.215029 0.232128 0.254564 0.237880 0.213040 0.198265 0.214487 0.232994 0.204020 0.214037 0.228762 0.205203 0.213527 0.215060 0.218880 0.231937 0.213980 0.218987 0.241511 0.199029 0.227630 0.254368 0.230942 0.197011 0.263740 0.225943 0.243616 0.382878
chargesum: 0.00000
title: Mulliken charges with hydrogens summed into heavy atoms:
elementType: O O O O O O O C C C C C C C C C C C C C C C C C C C
charge: -0.185294 -0.239261 -0.246867 -0.187634 -0.231542 -0.010979 -0.278374 0.150608 0.179589 0.095001 0.204827 0.121132 0.068528 -0.053471 -0.084076 -0.013305 0.138724 0.323920 -0.026299 -0.105549 -0.121438 0.033253 -0.023711 0.058321 0.158933 0.274965
polarizability: 2.53537794e+02 6.24527603e+00 2.45318012e+02 5.24284552e+00 2.40543535e+00 1.73765204e+02
1716.lowfreq: -12.1977 -9.8964 -4.7577 -0.0010 -0.0004 0.0001 12.2266 18.8362 28.0987
frequency: 10.4258 18.7085 28.0881 43.5082 60.4280 62.4613 72.2533 123.3398 131.4374 158.0520 163.0568 168.8739 177.8654 187.2360 194.5308 204.3236 225.5132 227.3404 233.7823 251.0464 265.2926 283.2696 294.4067 303.7480 316.6497 335.9178 357.6962 370.7473 392.0068 399.6586 421.2250 440.4900 449.5169 451.6465 457.8527 481.2112 491.9517 519.6573 531.2828 553.0501 563.7107 580.4817 595.3374 611.3613 620.2331 647.8750 678.6232 700.3327 723.9253 746.8875 753.8537 772.1374 819.7573 821.9216 833.0389 846.2366 861.8408 871.9919 883.7980 894.5903 924.9207 926.3409 936.0562 945.5882 961.2719 979.0069 996.3023 1007.8571 1012.8881 1026.3407 1041.0504 1045.4747 1054.2301 1062.0888 1069.0664 1082.3390 1089.8201 1093.7422 1100.2793 1110.1737 1117.8494 1123.1092 1128.2606 1135.1947 1140.5985 1154.0757 1176.2437 1185.8145 1188.8121 1212.3264 1213.4575 1214.7514 1245.2917 1250.4948 1257.4583 1266.7313 1278.9452 1285.6506 1291.5338 1306.9444 1307.6831 1314.0756 1322.3482 1326.7119 1332.1011 1338.0275 1345.4934 1349.2128 1353.6164 1364.4762 1368.5174 1374.0144 1378.7525 1379.7422 1385.5803 1389.9122 1393.3413 1406.5583 1446.0540 1452.0197 1455.3393 1461.7865 1463.8590 1464.2672 1468.3142 1471.4610 1473.9601 1476.9222 1480.4824 1481.8032 1487.2533 1638.7525 2927.4080 2944.6724 2951.2316 2958.7519 2970.7879 2972.8268 2974.9161 2977.2378 2983.0414 2985.2951 2992.5436 2994.0697 3004.0562 3004.2882 3004.7008 3008.0862 3022.2710 3040.4852 3048.4607 3057.4064 3059.9447 3064.1854 3065.0540 3067.9062 3077.0488 3079.7724 3082.6127 3104.8145 3122.3892 3568.7969
redmass: 5.8926 5.9014 9.3907 3.6435 4.1996 4.5803 3.1335 3.1971 3.6232 2.3823 1.2827 3.2018 4.0339 2.6546 2.7597 1.4569 2.0355 2.3522 2.5811 1.5582 2.0160 2.8825 3.6644 4.1145 3.3467 3.5287 3.6514 2.7861 3.4970 3.7872 3.4424 3.8532 3.7927 3.3496 3.6760 4.2886 5.0723 1.0995 3.5537 3.0652 3.6705 2.6677 3.8950 5.0225 3.4771 3.8371 3.8936 11.5711 8.6400 1.9722 4.5962 3.2021 2.9607 2.4764 2.1651 2.0173 2.5289 2.3177 2.2612 2.0819 1.9667 1.7176 2.2323 1.5218 4.6417 1.9753 2.0777 2.8903 1.9238 2.5607 2.3161 3.0648 2.8331 2.2611 2.2810 2.4829 2.1532 2.3257 2.5012 2.2301 2.6428 2.7185 2.7420 2.8149 2.7912 1.7353 1.9450 1.8630 1.7885 1.3606 2.1678 1.6911 1.3532 1.4130 1.3131 1.4169 1.2775 1.3165 1.2618 1.3818 1.2782 1.3670 1.7754 1.4072 1.2124 1.4179 1.4059 1.3147 1.2814 1.4751 1.5762 1.6747 1.2502 1.2388 1.1950 1.2136 1.2036 1.1335 1.0636 1.0741 1.0713 1.0729 1.0929 1.0590 1.0737 1.0728 1.0852 1.0667 1.0687 1.0477 1.0454 8.9772 1.0801 1.0816 1.0738 1.0701 1.0394 1.0555 1.0447 1.0814 1.0649 1.0823 1.0593 1.0649 1.0378 1.0791 1.0656 1.0604 1.0957 1.0939 1.1008 1.1021 1.0993 1.1011 1.0993 1.1015 1.0977 1.1042 1.0985 1.0994 1.1009 1.0651
irintensity: 0.0051 0.0176 0.0137 0.0044 0.5948 0.2101 0.4128 1.2422 2.3932 3.3457 0.8301 0.0808 1.5416 1.4217 4.2658 3.0688 1.2069 4.0239 0.5092 0.4826 0.0508 0.7939 7.0861 1.0185 0.8546 1.3180 1.4349 0.4935 13.0254 9.2238 1.0863 6.8228 2.0239 0.2926 2.1069 26.1259 3.6298 145.8004 0.8676 2.9101 4.5577 0.3564 0.5889 2.5184 6.2904 6.4815 5.7307 29.3108 4.9149 19.7156 3.8728 24.2688 4.1240 8.0492 7.1019 2.1618 8.7225 15.8432 2.6381 46.2161 14.7163 2.6021 5.3307 9.3762 1.7155 4.6034 17.7638 26.9676 4.3718 3.2384 51.6257 63.2489 124.1904 5.4396 29.1076 27.4470 507.6831 122.4487 16.5791 0.3856 18.3224 14.9405 21.4889 11.9804 30.5896 6.2056 1.9134 7.4117 1.4815 12.7301 31.2896 2.7171 1.5444 1.8507 3.7495 2.8698 1.0067 1.0049 0.6728 0.3215 2.6011 13.0129 169.8387 2.2096 9.0789 3.7213 10.9346 2.4703 3.8205 15.0838 1.5457 21.6160 2.7011 17.5940 4.8461 11.7782 16.6173 7.5526 4.2099 1.4214 6.7722 6.8741 18.9686 9.3049 8.8774 6.4612 18.9263 9.0000 6.3642 17.7925 20.9115 375.0984 5.3176 28.6265 9.6124 25.0766 35.8390 5.2902 39.2220 28.2338 16.9033 9.8106 27.2965 17.5273 16.9272 8.0872 48.2469 36.4448 58.5070 18.0295 14.5395 32.3346 52.8420 28.3996 31.6499 37.1501 40.9795 42.0365 26.3529 11.6867 14.5656 53.3150
temp: 298.150 k
press: 1.00000 atm
elementType: 8 8 8 8 8 8 8 6 6 6 6 6 6 6 6 6 6 6 6 6 6 6 6 6 6 6 1 1 1 1 1 1 1 1 1 1 1 1 1 1 1 1 1 1 1 1 1 1 1 1 1 1 1 1 1 1
symmnumber: 1
zpe: 1235702.7 jmol-1
zpe.correction: 0.470654 hartree
zpe.thermalcorrener: 0.496616 hartree
zpe.thermalcorrenthalpy: 0.497560 hartree
zpe.thermalcorrgfe: 0.413670 hartree
zpe.sumelectzpe: -1266.429991 hartree
zpe.sumelectthermal: -1266.404029 hartree
zpe.sumelectthermalent: -1266.403085 hartree
zpe.sumelectthermalfe: -1266.486975 hartree
dipole: -1.6526 -1.7019 -0.4261
dipole: 2.4102
quadrupole: -156.2194 -140.2109 -161.0438
quadrupole: 2.4761 6.7694 -0.1606
quadrupole: -3.7280 12.2804 -8.5524 2.4761 6.7694 -0.1606
hfenergy: -1266.9006451 hartree
pointgroup: C01[X(C19H30O7)]
dipole: 0.6393188 -0.6778371 0.1760254 debye
polarizability: 253.3567083|-6.3118801|245.4387681|5.0469171|-3.5700852|173.8255326 unknown
InChI: InChI=1S/C19H30O7/c1-11-6-7-14-12(2)15(5-4-10-22-17(20)21)23-16-19(14)13(11)8-9-18(3,24-16)25-26-19/h11-16,20H,4-10H2,1-3H3
charge 0 multiplicity 1
56 atoms
O  1.863009 0.577272 -1.588272
O  -0.201164 -0.479248 1.255825
O  0.341087 1.752808 0.792015
O  1.190427 2.013991 -1.508588
O  -4.661517 0.245319 0.173264
O  -5.827983 1.700585 -1.056654
O  -6.995961 0.004165 0.06691
C  1.748457 -0.065715 -0.234035
C  1.602459 -1.618011 -0.354753
C  3.046651 0.300401 0.565974
C  4.293907 -0.587201 0.158485
C  0.342803 0.412039 0.26318
C  0.150116 -2.067011 -0.692154
C  2.779142 -2.214643 -1.148178
C  4.022231 -2.060356 -0.248163
C  3.50135 1.769412 0.307339
C  -0.754095 -1.681986 0.532897
C  1.123254 2.62692 -0.151491
C  2.479906 2.898517 0.513116
C  5.375999 -0.563037 1.267035
C  0.038612 -3.58586 -0.953441
C  -2.23119 -1.44148 0.169872
C  0.283391 3.878674 -0.412966
C  -3.106421 -1.155017 1.407765
C  -4.58159 -0.951905 1.073217
C  -5.926284 0.58244 -0.232892
H  1.750673 -1.954638 0.696729
H  2.821573 0.149292 1.642841
H  4.716351 -0.102541 -0.747416
H  -0.303651 0.398855 -0.640886
H  -0.207853 -1.536029 -1.597184
H  2.913901 -1.695236 -2.116119
H  2.609203 -3.283957 -1.36664
H  3.874845 -2.681891 0.660357
H  4.929546 -2.448469 -0.751752
H  3.850721 1.81777 -0.74013
H  4.376519 1.982102 0.9480
H  -0.675215 -2.477592 1.300073
H  2.271262 3.063871 1.585978
H  2.902871 3.837508 0.106924
H  4.989037 -1.025728 2.195459
H  6.267755 -1.13794 0.953011
H  5.712578 0.459327 1.513198
H  0.520448 -3.868389 -1.905335
H  0.515466 -4.168172 -0.141374
H  -1.019639 -3.899523 -1.017908
H  -2.310888 -0.592028 -0.534814
H  -2.610963 -2.336868 -0.364337
H  0.798374 4.562861 -1.10776
H  -0.697653 3.599641 -0.82807
H  0.123937 4.39372 0.55047
H  -3.045091 -2.003418 2.120537
H  -2.711551 -0.266236 1.930998
H  -5.018424 -1.813824 0.534769
H  -5.191598 -0.748775 1.971497
H  -6.742927 1.949134 -1.349721
