program: Gaussian 09
title: 000053389
version: EM64L-G09RevD.01
frameworkgroup: C1[X(C21H27N3)]
method: RPBEPBE
basis: SDD
operation: Freq
keyword: #pfreq=noraman
keyword: PBEPBE/SDD
title: #p freq=noraman PBEPBE/SDD
converged: YES YES NO NO
title: Mulliken charges:
elementType: N N N C C C C C C C C C C C C C C C C C C C C C H H H H H H H H H H H H H H H H H H H H H H H H H H H
charge: -0.076662 -0.270511 -0.232625 -0.122246 -0.113395 -0.346159 -0.361325 -0.313426 -0.392505 -0.459291 -0.729728 -0.730745 0.208152 0.232720 0.184905 0.184837 -0.349168 -0.354718 -0.397547 -0.397471 -0.233891 -0.240113 -0.253828 -0.254953 0.225708 0.225712 0.195433 0.160552 0.159465 0.211473 0.158080 0.233380 0.228426 0.204176 0.238460 0.220204 0.229754 0.198168 0.208806 0.243039 0.212355 0.197827 0.241437 0.237760 0.233001 0.234163 0.234651 0.221453 0.220944 0.222565 0.222699
chargesum: 0.00000
title: Mulliken charges with hydrogens summed into heavy atoms:
elementType: N N N C C C C C C C C C C C C C C C C C C C C C
charge: -0.076662 -0.042084 -0.232625 0.103462 0.112317 0.009826 0.009613 0.078034 0.050131 -0.009333 -0.079715 -0.079126 0.208152 0.232720 0.184905 0.184837 -0.111409 -0.121717 -0.163384 -0.162820 -0.012439 -0.019169 -0.031263 -0.032253
polarizability: 2.49944317e+02 -4.83217801e-01 3.00351292e+02 4.55570246e+01 -1.21950793e+01 2.01764224e+02
1716.lowfreq: -18.5162 -0.0005 -0.0004 0.0002 2.8912 7.7844 13.0061 19.7354 29.6052
frequency: -12.2152 19.4858 28.6682 57.1285 80.2441 100.5516 115.2857 145.8007 149.4146 150.0725 153.8713 197.1005 206.2609 215.8388 226.1451 245.3745 275.0541 288.1793 297.7804 310.2074 369.9414 402.1820 421.3185 424.3522 427.1054 436.2850 448.9620 451.2037 462.1599 492.7682 524.6629 554.7265 567.6447 577.7596 580.1387 603.4399 614.7532 688.1929 706.2914 729.7503 746.2892 751.4821 756.8234 776.5245 787.8329 820.2425 839.5662 848.7051 854.7342 860.5714 868.2291 896.0580 915.6603 928.8500 931.7260 934.9093 958.2793 959.9964 970.0097 970.7061 972.5238 989.2107 1016.0364 1022.1437 1053.8955 1063.3878 1068.4559 1091.6013 1094.4349 1098.3135 1121.7185 1129.9847 1136.3747 1143.7975 1151.3713 1164.6222 1168.5737 1169.9643 1192.3443 1205.8972 1215.4028 1235.0102 1240.1959 1264.8803 1272.8397 1276.3694 1292.5879 1303.7142 1310.2303 1311.9050 1320.9329 1337.3737 1342.5027 1349.3315 1354.7706 1361.4017 1374.1422 1384.2080 1387.5271 1393.9359 1401.9698 1408.5401 1435.0218 1448.2542 1449.3754 1451.8996 1456.6842 1459.4434 1468.3439 1473.1728 1475.3070 1475.8386 1479.4255 1479.5554 1480.1475 1490.2252 1581.4489 1589.2891 1609.0756 1637.4421 2799.1679 2807.0232 2826.7422 2972.9309 2973.6112 2985.2293 2989.3622 2992.6194 2996.4473 3022.3981 3027.1724 3030.2701 3047.5641 3064.5143 3066.1627 3066.8944 3092.7118 3093.0116 3124.5464 3125.5105 3132.6711 3134.5485 3146.5052 3148.1362 3163.1819 3164.1547 3375.7872
redmass: 3.4816 4.8787 4.9535 3.6080 3.9540 3.5677 3.6555 2.2049 2.6397 3.1876 3.2581 2.1348 1.1126 3.4413 1.1550 2.5244 3.1097 4.0441 2.7532 3.1322 2.4471 4.6090 3.8462 3.0274 3.3442 3.2450 2.5524 2.8501 2.3164 2.1950 5.3764 3.9086 3.2288 3.5440 3.5334 4.2186 6.2766 1.9259 4.5595 2.2427 1.4774 2.6061 2.1041 2.5396 1.7430 2.2124 2.5091 1.4050 1.5575 2.2398 1.8366 2.2804 1.4108 2.0705 1.3801 1.4126 1.8370 1.8742 1.4447 1.8556 1.3074 7.2273 2.2067 1.9204 2.9204 2.3401 2.4077 2.5400 2.4272 2.1707 1.5071 1.7856 2.1417 2.3051 2.3486 1.8886 1.2178 1.1228 1.1808 1.5668 2.7212 1.9443 1.7239 1.4027 1.2839 1.3248 1.3104 1.4291 1.4339 1.7751 1.3775 1.5074 1.9678 1.8500 1.4380 1.3220 1.3037 1.2381 1.2868 1.4296 5.0338 3.6645 1.1536 1.2579 2.2889 2.4658 1.0991 1.1169 1.0541 1.0573 1.7689 1.3485 1.0595 1.0728 1.2992 3.6327 7.0450 6.6313 7.3794 7.6734 1.0704 1.0701 1.0694 1.0396 1.0393 1.0616 1.0816 1.0823 1.0619 1.0885 1.0861 1.0879 1.1014 1.1006 1.0969 1.0964 1.0996 1.0994 1.0847 1.0848 1.0890 1.0893 1.0949 1.0949 1.1002 1.1001 1.0733
irintensity: 0.1343 0.0652 0.0692 0.0570 0.7012 0.0555 2.9980 2.1650 0.7586 0.3475 0.4876 0.5377 0.0464 0.1397 0.1504 0.6255 0.5519 0.2510 2.0889 0.2612 5.3051 4.4188 3.0169 5.9243 7.2033 1.7026 5.8642 0.5807 1.2583 24.4038 2.5338 6.5390 0.2696 0.0945 1.2720 2.8022 3.2969 146.1908 0.4476 62.9941 1.1967 35.4735 109.8062 0.0915 10.2107 11.3981 8.1208 0.4856 0.0706 1.1175 5.2035 2.8779 0.6323 1.6524 4.3363 0.8278 2.2415 1.1060 0.1160 0.1271 0.0136 8.1887 1.6184 13.9650 9.2093 0.7887 14.9493 39.5292 3.7609 17.4559 5.0905 7.4822 13.6570 41.6166 55.6121 19.2788 4.0874 2.8503 47.1784 26.7346 0.1312 4.5017 22.3013 13.0692 4.9022 1.6297 3.2234 3.8590 5.9819 0.4996 28.1262 32.5384 27.0839 55.2072 0.6728 8.5239 4.9793 33.3618 14.3575 1.8684 1.2840 19.1090 12.9727 6.3651 11.0672 63.5358 3.5672 5.7812 18.2419 10.1944 50.2550 3.7940 8.2202 1.5487 27.2402 31.3797 0.4467 0.5595 35.1061 14.2830 57.6174 60.9707 171.3387 33.8772 25.4910 15.4820 1.3547 39.3141 52.1479 16.5281 29.1463 31.1384 20.1252 38.4886 38.7940 74.9747 10.2438 45.0661 0.5140 1.4187 8.9507 1.2037 21.5384 48.3517 56.1564 8.2548 3.8947
temp: 298.150 k
press: 1.00000 atm
elementType: 7 7 7 6 6 6 6 6 6 6 6 6 6 6 6 6 6 6 6 6 6 6 6 6 1 1 1 1 1 1 1 1 1 1 1 1 1 1 1 1 1 1 1 1 1 1 1 1 1 1 1
symmnumber: 1
zpe: 1146181.3 jmol-1
zpe.correction: 0.436557 hartree
zpe.thermalcorrener: 0.457601 hartree
zpe.thermalcorrenthalpy: 0.458545 hartree
zpe.thermalcorrgfe: 0.386721 hartree
zpe.sumelectzpe: -978.922604 hartree
zpe.sumelectthermal: -978.901560 hartree
zpe.sumelectthermalent: -978.900616 hartree
zpe.sumelectthermalfe: -978.972440 hartree
dipole: -0.9773 0.4812 -1.9596
dipole: 2.2421
quadrupole: -154.2785 -135.8164 -140.1536
quadrupole: -3.8793 12.5262 2.4660
quadrupole: -10.8623 7.5998 3.2626 -3.8793 12.5262 2.4660
hfenergy: -979.3591609 hartree
pointgroup: C01 [X(C21H27N3)]
dipole: -0.3926646 -0.0561346 0.7878779 debye
polarizability: 249.6497693|-1.6753291|296.1081544|-46.9226174|-20.8092831|206.3019101 unknown
InChI: InChI=1S/C21H27N3/c1-16-14-23(15-17(2)22-16)12-7-13-24-20-10-5-3-8-18(20)19-9-4-6-11-21(19)24/h3-6,8-11,16-17,22H,7,12-15H2,1-2H3
charge 0 multiplicity 1
51 atoms
N  -2.666511 0.354353 0.081432
N  -5.467825 0.263135 -0.744916
N  1.709428 0.322747 0.992256
C  -4.969692 1.319199 0.177348
C  -4.390852 -0.312999 -1.596896
C  -3.729766 0.852726 0.98772
C  -3.164685 -0.763986 -0.759562
C  -1.403191 0.026193 0.781381
C  -0.624157 1.282275 1.226329
C  0.731944 0.947088 1.894718
C  -6.108881 1.782028 1.099596
C  -4.957071 -1.463632 -2.443708
C  2.504585 1.020329 0.061177
C  2.035454 -1.04773 0.923243
C  3.361734 0.084597 -0.617017
C  3.063889 -1.232282 -0.067728
C  2.541228 2.402957 -0.224501
C  1.511227 -2.135363 1.656406
C  4.265152 0.553167 -1.598765
C  3.567834 -2.52984 -0.316162
C  3.454233 2.845879 -1.206209
C  2.034647 -3.419943 1.392694
C  4.307169 1.933655 -1.888968
C  3.051725 -3.619373 0.417302
H  -4.640957 2.166991 -0.456551
H  -4.045248 0.500218 -2.26625
H  -3.337595 1.704302 1.573469
H  -4.050378 0.057792 1.717033
H  -3.462361 -1.652804 -0.138157
H  -2.347087 -1.083219 -1.433103
H  -1.582913 -0.635077 1.671696
H  -0.769669 -0.550263 0.081533
H  -5.949332 -0.483229 -0.214987
H  -1.216804 1.869486 1.955117
H  -0.465962 1.926952 0.342262
H  0.572738 0.26618 2.751231
H  1.180261 1.87322 2.302951
H  -6.454388 0.954811 1.750971
H  -5.783416 2.61245 1.752052
H  -6.967147 2.12498 0.496563
H  -4.191065 -1.867875 -3.129807
H  -5.309906 -2.29589 -1.802661
H  -5.812349 -1.106466 -3.042787
H  1.886799 3.115548 0.288123
H  0.722399 -2.00085 2.403733
H  4.926018 -0.143576 -2.12662
H  4.350577 -2.688773 -1.066397
H  3.504027 3.913389 -1.449121
H  1.646558 -4.280556 1.949299
H  5.00152 2.311302 -2.647281
H  3.433961 -4.629822 0.23672
