program: Gaussian 09
title: 000053502
version: EM64L-G09RevD.01
frameworkgroup: C1[X(C23H27NO5)]
method: RPBEPBE
basis: SDD
operation: Freq
keyword: #p
keyword: freq=noraman
keyword: PBEPBE/SDD
title: #p freq=noraman PBEPBE/SDD
converged: YES YES NO NO
title: Mulliken charges:
elementType: O O O O O N C C C C C C C C C C C C C C C C C C C C C C C H H H H H H H H H H H H H H H H H H H H H H H H H H H
charge: -0.318469 -0.290862 -0.449762 -0.292457 -0.284426 -0.339312 -0.128603 -0.428351 -0.024195 -0.309565 0.189990 -0.016156 0.164305 0.188748 0.405587 -0.533257 -0.661174 -0.718464 -0.366246 -0.340354 0.285251 0.188774 -0.392370 -0.359529 -0.248972 -0.232091 -0.236880 -0.213196 -0.680013 0.213329 0.232683 0.220274 0.188847 0.227639 0.237864 0.251116 0.304724 0.202424 0.221434 0.215671 0.218105 0.208214 0.222556 0.252308 0.258623 0.352592 0.322755 0.268975 0.230044 0.228017 0.230552 0.229093 0.230097 0.228623 0.229497 0.215994
chargesum: 0.00000
title: Mulliken charges with hydrogens summed into heavy atoms:
elementType: O O O O O N C C C C C C C C C C C C C C C C C C C C C C C
charge: -0.318469 -0.290862 -0.097170 -0.292457 -0.284426 -0.088197 0.084726 0.024606 0.164652 0.155938 0.189990 -0.016156 0.164305 0.188748 0.405587 -0.228534 -0.021645 -0.069589 -0.113937 -0.081731 0.285251 0.188774 -0.069616 -0.090554 -0.018928 -0.004074 -0.006328 0.245994 -0.005899
chargesum: -0.00005
polarizability: 4.67636047e+02 -1.98547718e+01 2.87982330e+02 4.21795221e+01 1.17529691e+01 1.76500692e+02
1716.lowfreq: -9.8225 -2.2584 -1.2244 -0.1812 -0.0944 0.9787 6.3789 10.7974 14.0896
frequency: -5.0756 10.5757 14.0583 17.1371 32.4855 43.5143 53.5652 60.5863 74.2645 89.9303 91.9186 100.7890 116.3934 124.7933 146.6981 164.6705 179.2259 189.5756 206.7179 221.1988 223.7029 234.3682 255.0373 262.0414 275.1208 282.3983 310.5148 321.3878 341.0306 373.6124 381.9087 383.5824 404.0313 404.3246 418.5277 426.1479 434.9890 440.1116 456.5088 491.5358 492.1393 525.6287 604.2734 606.5698 613.0002 617.5539 656.6139 657.2049 671.8264 677.9213 699.1326 720.4076 759.8238 773.7648 787.6104 790.8767 798.2705 800.4355 810.5703 815.4129 839.4621 848.6691 868.0594 897.8810 905.7307 916.6699 923.4377 932.7192 939.6001 950.5414 956.0058 970.1415 988.0846 992.2739 998.5814 1004.4500 1022.0328 1025.8739 1029.4152 1048.3352 1078.0512 1086.1772 1087.0422 1103.4536 1111.6618 1119.6566 1135.2552 1135.9450 1154.1466 1157.0461 1172.0904 1176.9075 1180.1988 1186.9767 1209.7033 1217.6203 1225.3291 1247.4940 1247.9186 1250.6777 1265.6627 1309.3834 1315.8480 1332.2759 1338.2649 1344.7366 1350.8805 1361.0873 1369.6871 1374.9165 1380.6591 1383.3709 1389.3315 1399.0984 1409.4367 1434.7486 1444.2711 1449.0815 1449.9002 1464.6354 1465.2992 1465.6114 1466.6882 1473.5585 1475.6119 1477.8328 1484.8307 1487.8266 1488.9621 1531.0381 1574.2639 1592.0644 1601.1624 1616.3858 1632.0222 2863.1654 2925.6369 2972.8123 2979.2587 2980.6214 2994.2494 3011.1926 3028.3300 3054.1977 3056.3159 3064.7733 3069.0056 3076.5704 3082.8678 3089.0639 3090.6469 3105.3703 3127.9026 3141.1197 3157.4996 3163.8863 3167.1991 3181.8899 3182.4873 3214.9103 3425.4598 3527.6539
redmass: 2.9014 4.1330 4.5189 4.4037 4.0930 3.7659 4.7407 4.8309 4.5051 2.7257 4.0931 3.3291 4.2850 4.7555 3.4597 3.8141 4.4431 1.2678 3.2874 2.4559 5.7481 1.1253 1.2715 5.5346 5.5072 3.3219 4.7733 3.3672 5.8764 4.8080 3.8443 2.9856 3.4599 4.1491 3.2298 2.2850 3.0705 1.4451 2.4967 3.0638 3.8289 4.4697 4.4970 6.7635 3.7203 6.1956 3.4870 6.2772 1.7924 6.9357 1.8864 5.2349 4.0145 6.6702 2.1696 5.9529 1.5061 1.1193 4.2400 2.8737 4.4235 3.1217 1.2511 1.4752 3.2372 1.2028 1.5463 1.8717 2.1230 1.5287 1.4022 3.5079 5.3011 4.0469 1.3490 2.0119 3.2107 1.3168 3.0096 2.6882 2.0134 2.0863 2.5670 1.8250 2.2367 1.7713 2.1200 1.4621 3.6050 1.6350 2.0065 1.1582 1.9884 3.0825 1.1747 1.3971 1.3960 1.1369 2.6485 1.2587 1.9999 1.3168 2.6383 1.4587 1.3088 1.3664 1.3419 1.7834 1.3024 1.2884 1.3701 7.0682 1.2159 1.2920 6.2544 2.4412 2.3481 1.1535 2.3100 1.1799 1.0412 1.2283 1.2630 1.0963 1.0821 2.0100 1.0822 1.0912 1.0607 7.2195 6.2369 7.3757 8.1953 6.2237 8.6366 1.0826 1.0695 1.0361 1.0550 1.0358 1.0357 1.0582 1.0852 1.1017 1.0982 1.0989 1.1063 1.0991 1.0998 1.0992 1.0985 1.1029 1.0854 1.0904 1.0955 1.0882 1.0976 1.0957 1.0969 1.0921 1.0742 1.0651
irintensity: 0.1334 0.8077 0.0637 0.1858 0.1028 0.8467 0.3503 0.4195 0.1794 2.8940 0.3222 1.0057 0.4112 1.9121 0.5284 0.8397 3.1825 0.6445 0.9386 8.7138 2.5408 0.7997 0.8429 0.9782 0.7353 0.1089 17.9873 2.3577 1.7313 0.5811 5.0159 2.1603 0.7572 1.2120 7.7291 38.8479 5.6914 104.5605 47.7543 0.3159 14.0754 14.5506 4.8584 13.8723 0.4391 4.5917 16.1964 3.8256 46.2161 4.7420 45.0210 20.9609 26.6559 21.7703 30.8076 5.3592 45.4006 6.0935 2.1780 3.2986 0.5037 16.5386 0.0238 23.0837 37.7966 4.8529 4.3128 2.9815 4.7496 7.4683 5.7807 115.9824 17.2142 98.5769 0.0000 48.8162 20.7839 2.5246 162.5604 72.4312 55.3356 46.3042 21.3493 11.8799 2.6948 3.7795 29.7349 6.1676 429.2367 28.1820 120.7707 13.0028 50.9605 6.7606 6.6831 7.2069 21.4185 0.0045 1.5314 11.0463 107.4518 16.6042 100.6532 5.5225 11.5878 10.0592 4.0646 7.6974 9.8903 23.2611 56.7802 0.1603 28.1515 21.1297 19.1947 226.7739 103.0249 19.2967 61.4526 11.1760 12.7375 13.3606 17.7800 10.8398 8.5862 12.4623 0.4933 11.2587 23.5350 156.2995 19.5548 53.8067 151.5550 58.5934 48.5557 88.6817 81.4109 41.1249 30.0259 13.1449 19.9459 20.5285 27.9595 19.2328 40.5593 41.5184 5.8530 37.4812 25.3853 60.0412 35.8872 44.0954 0.2475 27.5294 13.8328 3.0149 71.5247 15.3331 6.6326 6.9933 1.8835 18.1969
temp: 298.150 k
press: 1.00000 atm
elementType: 8 8 8 8 8 7 6 6 6 6 6 6 6 6 6 6 6 6 6 6 6 6 6 6 6 6 6 6 6 1 1 1 1 1 1 1 1 1 1 1 1 1 1 1 1 1 1 1 1 1 1 1 1 1 1 1
symmnumber: 1
zpe: 1192759.7 jmol-1
zpe.correction: 0.454298 hartree
zpe.thermalcorrener: 0.482389 hartree
zpe.thermalcorrenthalpy: 0.483333 hartree
zpe.thermalcorrgfe: 0.392038 hartree
zpe.sumelectzpe: -1321.357861 hartree
zpe.sumelectthermal: -1321.329770 hartree
zpe.sumelectthermalent: -1321.328826 hartree
zpe.sumelectthermalfe: -1321.420121 hartree
dipole: -1.7663 -1.0008 1.4760
dipole: 2.5100
quadrupole: -155.4630 -152.7527 -179.8561
quadrupole: 2.0120 -8.7434 6.7575
quadrupole: 7.2276 9.9379 -17.1655 2.0120 -8.7434 6.7575
hfenergy: -1321.812159 hartree
pointgroup: C01 [X(C23H27N1O5)]
dipole: 0.5829722 -0.1062901 0.7899552 debye
polarizability: 475.0278924|-6.7894076|252.8523972|-4.0166715|54.6302583|204.2387797 unknown
InChI: InChI=1S/C23H27NO5/c1-4-27-23(26)21-19-12-18(28-14-17(25)13-24-15(2)3)10-11-20(19)29-22(21)16-8-6-5-7-9-16/h5-12,15,17,24-25H,4,13-14H2,1-3H3
charge 0 multiplicity 1
56 atoms
O  2.824565 0.477481 -0.454321
O  -2.531539 1.602032 0.496044
O  5.124544 0.443276 -1.985307
O  -1.069734 -2.125743 -1.824632
O  -3.384102 -2.182881 -1.744269
N  5.847431 -0.321727 1.643299
C  5.206269 0.692195 -0.53914
C  5.515412 -0.614773 0.231034
C  5.685257 -1.444286 2.612334
C  3.926398 1.369595 -0.033487
C  -0.846121 0.282647 -0.383532
C  -2.141124 -0.337358 -0.694886
C  -1.13897 1.465498 0.346136
C  -3.148284 0.495675 -0.143959
C  1.501665 0.854593 -0.15857
C  0.50834 -0.028522 -0.640736
C  4.191858 -1.668065 2.937697
C  6.479639 -1.109456 3.891186
C  -0.176321 2.351947 0.834641
C  1.17473 2.033904 0.573293
C  -4.61488 0.542072 -0.04941
C  -2.310796 -1.592474 -1.44214
C  -5.469156 -0.448396 -0.615978
C  -5.213254 1.640243 0.646103
C  -6.869111 -0.33691 -0.487178
C  -6.610803 1.740274 0.768208
C  -7.450538 0.75129 0.201715
C  -1.132463 -3.404772 -2.594013
C  0.305883 -3.790067 -2.925928
H  6.048868 1.398689 -0.419495
H  6.323693 -1.147995 -0.319057
H  4.618249 -1.258848 0.202256
H  6.095541 -2.395422 2.189052
H  3.793487 2.362814 -0.50488
H  3.961655 1.45083 1.069579
H  6.786164 0.09441 1.723183
H  0.790542 -0.921936 -1.196485
H  4.066541 -2.542976 3.602409
H  3.594542 -1.848978 2.026101
H  3.778722 -0.775693 3.441801
H  6.356088 -1.904461 4.647432
H  7.561828 -1.007588 3.679971
H  6.118207 -0.158018 4.323509
H  -0.454726 3.249541 1.392769
H  1.959688 2.699456 0.940634
H  4.229102 0.048493 -2.156753
H  -5.029261 -1.293817 -1.149633
H  -4.571124 2.407555 1.085071
H  -7.507611 -1.109037 -0.930412
H  -7.047064 2.590023 1.304769
H  -8.539387 0.829849 0.296666
H  -1.641043 -4.161481 -1.969667
H  -1.746615 -3.238221 -3.497258
H  0.899499 -3.93603 -2.006952
H  0.792639 -3.012233 -3.539171
H  0.31488 -4.736323 -3.497044
