program: Gaussian 09
title: 000053354
version: EM64L-G09RevD.01
frameworkgroup: C1[X(C8H8ClN2)]
method: RPBEPBE
basis: SDD
operation: Freq
keyword: #p
keyword: freq=noraman
keyword: PBEPBE/SDD
title: #p freq=noraman PBEPBE/SDD
converged: YES YES NO NO
title: Mulliken charges:
elementType: Cl N N C C C C C C C C H H H H H H H H
charge: 0.072932 -0.095847 -0.366922 0.312312 0.265572 -0.035753 -0.288048 -0.297100 -0.614297 -0.190622 -0.178047 0.383408 0.318456 0.277068 0.273925 0.304288 0.319425 0.268894 0.270355
chargesum: 1.00000
title: Mulliken charges with hydrogens summed into heavy atoms:
elementType: Cl N N C C C C C C C C
charge: 0.072932 -0.095847 0.016486 0.312312 0.265572 0.282703 -0.010979 -0.023175 0.009417 0.078272 0.092308
polarizability: 1.32004648e+02 -8.66753027e+00 1.13911593e+02 -6.90915283e+00 -2.29131185e+00 5.58294281e+01
1716.lowfreq: -7.1157 -0.0013 0.0016 0.0019 6.7229 14.8536 50.8046 82.9869 200.1534
frequency: 50.7130 82.9786 200.1525 219.9753 251.0430 363.8967 416.5267 465.6570 527.0198 564.0868 579.9979 611.9629 686.9554 707.8953 722.3358 756.4533 761.2230 767.6652 841.0941 866.8578 875.0166 940.0810 961.1340 1006.6145 1013.5379 1074.9870 1115.5024 1159.4105 1166.7587 1187.4821 1243.5234 1273.8315 1287.1142 1326.1898 1353.6266 1409.9724 1421.7760 1456.5785 1463.8864 1492.5887 1534.0383 1618.3006 1627.5977 3090.9080 3164.2452 3171.7389 3174.9597 3182.0584 3192.3073 3261.1321 3568.4864
redmass: 6.3796 6.7518 4.9138 4.0353 2.8942 6.5933 2.9269 3.4313 5.9263 3.6080 4.9163 4.1383 4.8822 1.2141 5.8196 4.4695 4.9968 1.2660 1.4725 1.4103 5.2106 1.5241 1.3614 1.3523 2.1295 4.0891 1.7792 1.3072 1.2392 1.1406 2.2591 1.4921 1.6361 1.9418 1.6626 3.1035 4.9069 1.2916 2.0351 2.3792 4.4232 7.3140 6.8821 1.0567 1.0884 1.0918 1.1141 1.0972 1.1010 1.1031 1.0837
irintensity: 3.0512 1.9860 1.4528 14.6138 1.4094 1.5158 11.9885 7.2046 2.2023 0.6492 7.0435 11.0865 51.3838 83.1082 28.9376 0.5708 8.8074 164.0869 0.3204 0.5074 4.0845 0.6814 1.9594 0.0398 1.9444 3.2859 16.6190 5.9887 33.9458 12.4099 19.7662 33.2942 36.7445 6.4664 27.8091 14.5570 14.2240 15.2827 8.5391 19.0313 91.7757 17.6853 6.0710 3.6913 0.4918 0.6708 0.1719 0.1313 0.1072 45.1317 181.3378
temp: 298.150 k
press: 1.00000 atm
elementType: 17 7 7 6 6 6 6 6 6 6 6 1 1 1 1 1 1 1 1
symmnumber: 1
zpe: 390340.7 jmol-1
zpe.correction: 0.148673 hartree
zpe.thermalcorrener: 0.157439 hartree
zpe.thermalcorrenthalpy: 0.158383 hartree
zpe.thermalcorrgfe: 0.113678 hartree
zpe.sumelectzpe: -878.205178 hartree
zpe.sumelectthermal: -878.196412 hartree
zpe.sumelectthermalent: -878.195468 hartree
zpe.sumelectthermalfe: -878.240173 hartree
dipole: 1.9818 4.8641 1.6304
dipole: 5.4996
quadrupole: -46.6656 -41.1026 -68.6171
quadrupole: -3.5538 -8.4403 -3.3544
quadrupole: 5.4628 11.0258 -16.4886 -3.5538 -8.4403 -3.3544
hfenergy: -878.3538507 hartree
pointgroup: C01 [X(C8H8Cl1N2)]
dipole: -0.3796809 -1.9627401 0.8277172 debye
dipolederiv: -0.2568531 -0.0947224 0.025048 -0.1808349 -0.1873321 0.0558476 0.2374035 0.1642063 -0.2536234 -0.4826191 -0.2246841 0.0376557 -0.6255777 -0.529219 0.0254545 -0.2024986 -0.1113063 -0.1534263 -0.3977972 -0.4363964 -0.0006304 -0.179595 -0.4210082 -0.0138986 -0.0609985 -0.1141849 -0.1946 0.1807128 -0.0105199 -0.0328456 -0.3613163 0.0279512 -0.0184329 -0.0290019 0.0006034 0.0451273 0.2266364 -0.1923415 -0.0160804 -0.0487076 -0.0009802 0.0124371 0.0268079 -0.0370888 0.0600142 0.0854344 0.5361604 0.049615 0.6983465 0.5746199 0.0622491 0.1291397 0.1960868 0.0622894 -0.0801022 0.0251522 0.0172621 0.0722725 0.084286 0.0155429 -0.0103594 0.0220454 -0.1112998 0.0418734 0.0562364 0.0379089 0.080022 0.0319301 0.0264287 0.0371636 0.0285738 -0.1127805 0.8631149 0.3959495 -0.1664008 0.606098 0.5232054 -0.212617 -0.1883498 -0.1905019 0.5559362 -0.077053 0.0127045 0.0004996 -0.1247104 0.1953608 0.0122688 -0.004588 0.0300031 -0.0953523 0.1828451 -0.0341685 0.042712 0.1031369 -0.129963 0.0142158 0.0580601 -0.0085297 -0.0887985 0.2128246 0.0272929 -0.0192653 0.046781 0.3979401 -0.0015575 -0.0221574 0.0122282 0.359993 0.1590554 -0.0326927 -0.0124128 -0.041969 0.1736217 -0.0188414 -0.0097615 -0.0121033 0.2066615 0.0558805 -0.0622038 -0.0293402 -0.0439924 0.0734613 -0.0134516 -0.0149954 -0.0171264 0.1659217 0.0939189 -0.0186145 -0.0165443 -0.0406476 0.0222264 -0.0267825 -0.0202965 -0.0238398 0.1789812 0.0489812 -0.0189135 0.0134047 0.040579 0.0065124 0.0983797 0.0254082 0.061534 0.0462991 0.0652702 0.0221765 0.101949 -0.0537429 0.0386888 -0.0002742 0.0847624 0.0145053 0.0044658 0.0812588 0.0434029 -0.0064952 0.0381143 0.0147618 -0.011903 -0.010451 -0.0094274 0.162559 -0.0033821 0.0061819 -0.0260398 0.0157436 0.1039365 -0.0050655 -0.0252874 -0.0056778 0.1616323 unknown
polarizability: 134.9481176|-4.2703482|111.5749634|3.6005651|-1.0787427|55.2225887 unknown
InChI: InChI=1S/C8H8ClN2/c9-5-11-6-10-7-3-1-2-4-8(7)11/h1-4,6,10H,5H2
charge 1 multiplicity 1
19 atoms
Cl 3.051043 1.425593 -0.955123
N  1.312346 -0.248752 0.372347
N  0.070349 -2.029064 -0.075502
C  -0.02175 0.219856 0.205633
C  -0.819954 -0.928987 -0.072382
C  1.330308 -1.600446 0.185218
C  -0.577053 1.512526 0.266067
C  -2.209091 -0.839841 -0.287341
C  2.484328 0.583782 0.618066
C  -1.967265 1.603594 0.051522
C  -2.766619 0.452512 -0.217342
H  -0.186619 -3.004352 -0.242444
H  2.215673 -2.228984 0.234758
H  0.026364 2.404665 0.452397
H  -2.827229 -1.716358 -0.499878
H  3.321105 -0.029054 0.976913
H  2.239603 1.379669 1.332989
H  -2.447323 2.585879 0.08565
H  -3.841117 0.578861 -0.378148
