program: Gaussian 09
title: 000006807
version: EM64L-G09RevD.01
frameworkgroup: C1[X(C7H5NO5)]
method: RPBEPBE
basis: SDD
operation: Freq
keyword: #pfreq=noraman
keyword: PBEPBE/SDD
title: #p freq=noraman PBEPBE/SDD
converged: YES YES NO NO
title: Mulliken charges:
elementType: O O O O O N C C C C C C C H H H H H
charge: -0.340533 -0.416859 -0.322400 -0.221448 -0.162033 0.020663 0.118511 0.079383 0.277565 -0.317719 -0.327927 -0.211089 0.197120 0.281622 0.298124 0.248564 0.397809 0.400648
chargesum: 0.00000
title: Mulliken charges with hydrogens summed into heavy atoms:
elementType: O O O O O N C C C C C C C
charge: 0.057276 -0.016212 -0.322400 -0.221448 -0.162033 0.020663 0.118511 0.079383 0.277565 -0.036097 -0.029803 0.037475 0.197120
polarizability: 1.55563951e+02 3.56373449e+00 1.23880511e+02 -2.07220354e-01 -2.19921314e-01 3.90260805e+01
1716.lowfreq: -32.4484 -3.2945 -0.0005 0.0002 0.0004 5.5536 6.2240 68.9025 124.8453
frequency: -32.4242 68.9001 124.8446 181.8234 183.0035 257.1168 274.0780 335.7652 392.7097 398.3121 439.8673 451.2558 534.7041 566.6523 584.3982 594.2927 630.2493 661.8732 715.3636 723.7744 750.2080 821.8185 828.8990 851.2171 889.7057 970.8171 1002.0478 1047.8949 1085.5357 1139.3090 1175.1217 1189.5814 1193.8521 1271.3275 1323.6407 1363.3016 1390.4844 1411.0877 1448.3384 1459.7628 1570.1254 1581.5542 1644.7149 2907.6263 3162.5307 3176.3332 3188.9378 3532.2379
redmass: 13.7906 8.6612 13.5067 9.8159 4.6573 5.7597 7.1775 11.3343 7.5337 8.6025 4.3092 11.2303 3.4612 6.6238 1.2749 5.4949 5.7021 5.7336 7.4062 9.3001 2.8954 1.7584 6.2004 8.1141 1.0792 1.3711 1.3573 3.4927 1.9110 3.0548 1.1766 1.8596 6.9587 3.7548 1.9366 7.1194 8.4746 2.4507 2.9589 3.2745 5.1455 4.8487 4.7498 1.0708 1.0875 1.0921 1.0995 1.0643
irintensity: 0.2084 0.1651 0.0228 0.4482 1.2536 0.9987 0.7840 3.0288 11.0515 2.6467 6.5133 3.7930 8.4889 23.6979 124.0341 1.6794 78.2633 34.7174 4.0963 5.7373 50.8562 26.6109 8.2714 22.8709 152.9377 0.0865 1.6565 375.7113 40.1452 125.0540 2.3591 20.0853 269.8661 14.2421 105.9925 21.5933 36.8097 215.9101 84.5765 145.6816 45.4789 109.3157 205.3239 404.2997 3.0333 4.0783 4.6825 89.0197
temp: 298.150 k
press: 1.00000 atm
elementType: 8 8 8 8 8 7 6 6 6 6 6 6 6 1 1 1 1 1
symmnumber: 1
zpe: 308020.4 jmol-1
zpe.correction: 0.117319 hartree
zpe.thermalcorrener: 0.127112 hartree
zpe.thermalcorrenthalpy: 0.128056 hartree
zpe.thermalcorrgfe: 0.081707 hartree
zpe.sumelectzpe: -699.606828 hartree
zpe.sumelectthermal: -699.597035 hartree
zpe.sumelectthermalent: -699.596091 hartree
zpe.sumelectthermalfe: -699.642440 hartree
dipole: -6.0667 4.0580 0.0191
dipole: 7.2988
quadrupole: -76.2138 -73.7063 -73.7321
quadrupole: 4.9538 0.0928 0.1979
quadrupole: -1.6630 0.8444 0.8186 4.9538 0.0928 0.1979
hfenergy: -699.7241471 hartree
pointgroup: C01 [X(C7H5N1O5)]
dipole: -2.399066 -1.5779769 -0.0209673 debye
dipolederiv: -0.4399117 0.1887157 -0.0102674 0.2030469 -1.069018 0.0230793 -0.006079 0.0219652 -0.3410287 -1.3584371 -0.3225111 -0.0165663 -0.5312642 -0.3863991 -0.0165061 -0.0090503 -0.0102759 -0.4119293 -0.8402542 0.1835428 -0.0189936 0.2146457 -1.0378603 0.0248055 -0.0203848 0.0246074 -0.351561 -0.9219345 0.1573523 -0.0397721 0.1286861 -0.5130001 0.0273958 -0.0353696 0.0255484 -0.2460874 -0.5029202 -0.163728 -0.003619 -0.1570269 -0.6762336 0.0320328 -0.009527 0.0278068 -0.2004523 1.7717287 0.1401981 0.0586781 0.2969184 1.0585916 -0.0625012 0.0533927 -0.0558331 0.198476 -0.7665546 0.0521016 -0.0215305 0.5932224 -0.4960157 0.028142 -0.0370843 0.0134511 -0.0492135 0.3627412 -0.166883 0.0095498 -0.1464355 0.9617195 -0.0222533 0.0147485 -0.0223031 0.1407943 -0.5620988 0.0783822 -0.0189363 -0.4251333 -0.3876428 0.005772 -0.0029253 0.0185891 0.0115218 0.402213 -0.0037472 0.0130462 -0.6277928 0.2166603 -0.0246904 0.0303395 -0.0076762 -0.0509912 0.2748825 0.0106563 0.0093461 0.5948582 0.1984219 0.0098516 -0.0154827 -0.0112332 -0.0582529 -0.842145 -0.027217 -0.0173445 -0.0272127 0.1084845 -0.0091403 -0.019093 -0.0102463 -0.1850685 2.199478 -0.1636028 0.0573241 -0.1586627 1.2390529 -0.031127 0.0575593 -0.032663 0.2743038 0.0477638 -0.0615582 -0.0013107 -0.0495384 0.0939655 0.0002945 -0.0013161 0.0004699 0.1568722 0.0968909 0.0599363 -0.0030671 0.0242523 0.1356955 0.0008062 -0.0006601 0.0049007 0.1645934 0.0732388 0.0019221 -0.0026442 0.000973 -0.0725053 0.0068555 -0.0016954 0.0068592 0.1676109 0.5989269 -0.0245748 0.0081225 -0.0623226 0.4412363 -0.0035028 0.0073315 -0.0026922 0.3700024 0.4063922 0.0610147 -0.0020151 0.128786 0.1848472 0.0106859 -0.0047039 0.0087253 0.4104101 unknown
polarizability: 155.4008611|-3.7048928|123.8248536|3.5580465|-3.177387|39.2448283 unknown
InChI: InChI=1S/C7H5NO5/c9-6-4(7(10)11)2-1-3-5(6)8(12)13/h1-3,9-10H
charge 0 multiplicity 1
18 atoms
O  -0.027744 1.86937 -0.068659
O  -3.62849 -0.329118 -0.107232
O  -2.587266 1.736057 -0.138205
O  3.603636 -0.315052 0.134522
O  2.624599 1.732551 -0.048127
N  2.560896 0.45245 0.037531
C  -1.222186 -0.267249 -0.042825
C  0.001062 0.508413 -0.03226
C  1.234586 -0.217773 0.023142
C  -1.188826 -1.682843 -0.001628
C  1.240479 -1.628981 0.06617
C  0.038441 -2.365636 0.053356
C  -2.494497 0.463076 -0.099399
H  -2.137938 -2.226099 -0.013217
H  2.214156 -2.124672 0.110401
H  0.065243 -3.45792 0.085137
H  -1.008881 2.174684 -0.101677
H  -4.43737 0.24874 -0.148732
