program: Gaussian 09
title: 000053264
version: EM64L-G09RevD.01
frameworkgroup: C1[X(C18H14O3)]
method: RPBEPBE
basis: SDD
operation: Freq
keyword: #pfreq=noraman
keyword: PBEPBE/SDD
title: #p freq=noraman PBEPBE/SDD
converged: YES YES NO NO
title: Mulliken charges:
elementType: O O O C C C C C C C C C C C C C C C C C C H H H H H H H H H H H H H H
charge: -0.298659 -0.469861 -0.467946 -0.158676 -0.335768 -0.186867 0.182940 -0.209519 0.214276 0.109463 -0.418403 0.452643 0.161679 -0.463031 0.413489 -0.473978 -0.493218 -0.368801 -0.449588 -0.276426 -0.249231 0.251279 0.291705 0.266153 0.234079 0.293104 0.357244 0.243109 0.367763 0.240667 0.238189 0.301389 0.240039 0.230844 0.229916
chargesum: 0.00000
title: Mulliken charges with hydrogens summed into heavy atoms:
elementType: O O O C C C C C C C C C C C C C C C C C C
charge: -0.298659 -0.112616 -0.100184 0.092603 -0.044063 0.079286 0.182940 0.024560 0.214276 0.109463 -0.125299 0.452643 0.161679 -0.219921 0.413489 -0.233311 -0.255029 -0.067412 -0.209549 -0.045582 -0.019315
polarizability: 3.06303031e+02 1.93225134e+01 2.37281680e+02 -1.07688009e+00 -7.72031964e-01 9.30094877e+01
1716.lowfreq: -5.0916 -0.0004 0.0000 0.0004 5.1686 6.2068 54.3271 55.1128 98.6050
frequency: 54.3157 55.1103 98.6030 116.0906 140.5597 172.0861 237.2340 241.2994 253.4786 258.9641 266.5376 307.3151 318.1068 359.8805 398.5783 410.5486 421.1339 430.1591 454.2061 464.2970 473.3322 492.3025 513.8284 525.6499 559.6892 567.8406 589.2770 632.3355 646.1434 695.2497 705.3748 735.7911 749.2910 760.5430 782.2675 794.9850 821.4291 825.4125 839.9093 871.8484 883.7487 891.8817 955.2160 964.7792 971.5089 980.8961 986.6413 993.6085 997.0741 1013.4540 1041.7567 1051.5463 1062.3488 1087.7319 1112.2438 1133.3844 1164.8147 1169.2198 1179.3006 1181.7124 1195.5579 1217.6982 1233.2341 1234.4768 1247.7707 1251.0975 1256.3481 1304.8523 1307.8493 1327.6865 1345.0485 1371.7045 1374.2742 1389.2337 1393.0191 1415.2067 1424.6409 1435.1181 1454.9370 1508.3838 1527.5702 1568.3631 1602.3342 1617.4975 1629.7921 2916.2898 3010.3096 3095.8460 3111.6213 3119.4407 3121.5699 3129.6853 3135.9443 3145.5050 3158.6777 3181.3659 3202.2619 3534.4979 3588.1627
redmass: 5.5384 5.4630 5.4801 4.7071 6.9151 4.7942 4.4589 5.6457 5.2130 4.3097 5.6194 1.3967 2.6223 6.3161 5.1608 4.7813 3.4588 5.7960 1.3934 3.4291 4.1843 3.7650 5.8052 3.6565 4.3869 4.4807 4.0781 6.2997 4.8101 6.3379 4.8629 5.0828 4.4285 1.3111 3.5341 3.3343 2.2096 2.3400 4.3768 1.7821 4.2303 1.5926 2.2537 1.5522 2.6517 1.7188 2.2268 1.6844 1.4990 2.5927 2.8216 2.5387 1.4666 3.0595 1.5533 1.7474 1.2714 1.3037 1.3403 1.1579 1.4431 1.3284 2.0464 1.5957 1.5134 1.4952 1.7338 1.6665 1.3647 1.7707 2.9756 1.7665 1.8725 4.5596 4.6098 2.0440 4.3751 3.1691 2.3593 3.5214 4.4921 7.8214 6.4760 6.3153 6.8183 1.0813 1.0856 1.0873 1.0925 1.0865 1.0864 1.0902 1.0906 1.0988 1.0987 1.0947 1.0930 1.0649 1.0666
irintensity: 0.9983 0.5754 1.7251 1.5767 3.0473 1.9128 2.5371 7.5668 4.8183 16.9135 8.6142 87.9817 32.7343 12.7856 3.0929 1.1212 3.8746 0.7305 121.9674 35.2943 1.7384 15.9583 6.8989 10.3194 13.6312 9.9657 6.1570 10.3856 23.2308 17.2458 6.5446 8.1840 13.3019 48.2617 16.5297 9.1731 15.5641 5.7448 23.8840 56.1096 17.7089 36.7001 13.4725 4.4170 22.4846 7.4514 8.4289 11.0420 1.8469 55.3506 45.2296 58.4893 7.7545 36.1696 4.5077 2.6593 2.3620 19.5695 54.5377 4.9410 17.0874 7.4053 1.2386 0.5766 3.2910 12.2318 10.8142 3.9611 10.4165 1.8729 8.2001 24.7270 0.3764 8.1846 2.4417 4.8208 3.2481 0.2920 14.1489 11.7084 4.9945 1.0090 6.2957 0.4410 2.2174 29.5587 16.2471 10.8367 18.8731 0.7009 2.7554 11.4576 15.1054 37.9397 36.9782 3.5577 10.0433 27.9117 18.1266
temp: 298.150 k
press: 1.00000 atm
elementType: 8 8 8 6 6 6 6 6 6 6 6 6 6 6 6 6 6 6 6 6 6 1 1 1 1 1 1 1 1 1 1 1 1 1 1
symmnumber: 1
zpe: 711471.5 jmol-1
zpe.correction: 0.270985 hartree
zpe.thermalcorrener: 0.286985 hartree
zpe.thermalcorrenthalpy: 0.287929 hartree
zpe.thermalcorrgfe: 0.228505 hartree
zpe.sumelectzpe: -918.500383 hartree
zpe.sumelectthermal: -918.484384 hartree
zpe.sumelectthermalent: -918.483439 hartree
zpe.sumelectthermalfe: -918.542864 hartree
dipole: 0.3129 -0.8843 0.8563
dipole: 1.2701
quadrupole: -102.8574 -111.5407 -125.5191
quadrupole: -10.0080 -2.5701 -1.0390
quadrupole: 10.4483 1.7650 -12.2133 -10.0080 -2.5701 -1.0390
hfenergy: -918.7713687 hartree
pointgroup: C01 [X(C18H14O3)]
dipole: -0.1178118 -0.3468578 -0.3398714 debye
polarizability: 306.8192018|-18.3706182|236.7476425|-0.8866986|1.8773002|93.0273545 unknown
InChI: InChI=1S/C18H14O3/c19-15-12-8-7-10-6-5-9-3-1-2-4-11(9)13(10)14(12)17-18(21-17)16(15)20/h1-8,15-20H
charge 0 multiplicity 1
35 atoms
O  -1.268798 -2.425114 0.529204
O  -4.801606 -1.444382 -0.027787
O  -4.231733 1.292334 0.218036
C  -2.378878 -1.955942 -0.370304
C  -1.013074 -1.386608 -0.594809
C  -3.416583 -1.037942 0.268364
C  -0.731252 0.031222 -0.213701
C  -3.262794 0.360332 -0.355792
C  -1.851942 0.899335 -0.137396
C  0.609203 0.543002 -0.041117
C  -1.681053 2.289323 0.088337
C  0.758633 1.977758 0.078304
C  1.829914 -0.282849 -0.001033
C  -0.391542 2.817587 0.163485
C  3.120916 0.373264 -0.055236
C  2.070605 2.58384 0.081171
C  3.208277 1.81495 -0.031707
C  1.833975 -1.709679 0.146084
C  4.321581 -0.400855 -0.075404
C  3.027794 -2.447227 0.142802
C  4.284303 -1.797202 0.003712
H  -2.771707 -2.711441 -1.063898
H  -0.397371 -1.813776 -1.395703
H  -3.241928 -0.978645 1.361197
H  -3.456047 0.252077 -1.448649
H  -2.569856 2.918926 0.171728
H  -5.055337 -2.213879 0.539497
H  -0.244201 3.897633 0.280381
H  -5.112094 0.833946 0.18327
H  2.135459 3.675822 0.151428
H  4.200474 2.279629 -0.067627
H  0.90507 -2.250057 0.328515
H  5.2820 0.125324 -0.133407
H  2.98645 -3.534824 0.268211
H  5.211041 -2.381084 -0.008452
