program: Gaussian 09
title: 000053238
version: EM64L-G09RevD.01
frameworkgroup: C1[X(C14H16N2)]
method: RPBEPBE
basis: SDD
operation: Freq
keyword: #pfreq=noraman
keyword: PBEPBE/SDD
title: #p freq=noraman PBEPBE/SDD
converged: YES YES NO NO
title: Mulliken charges:
elementType: N N C C C C C C C C C C C C C C H H H H H H H H H H H H H H H H
charge: -0.331830 -0.556122 -0.254473 0.510144 0.348683 -0.467385 -0.404987 -0.717657 -0.398907 -0.402730 0.340244 -0.397743 -0.397589 -0.235967 -0.236230 -0.242934 0.195805 0.230762 0.274230 0.232399 0.209984 0.238530 0.236865 0.237032 0.278546 0.237936 0.238198 0.224620 0.224858 0.254993 0.301692 0.229032
chargesum: 0.00000
title: Mulliken charges with hydrogens summed into heavy atoms:
elementType: N N C C C C C C C C C C C C C C
charge: -0.053284 0.000563 -0.058668 0.510144 0.348683 -0.236623 -0.130758 -0.036744 -0.162042 -0.165697 0.340244 -0.159807 -0.159391 -0.011347 -0.011372 -0.013902
polarizability: 2.64133892e+02 7.63818639e+00 1.49415313e+02 -2.38385457e+00 1.44491200e+01 1.00080205e+02
1716.lowfreq: -10.7866 -3.5740 -0.0002 0.0004 0.0008 9.3990 34.5357 45.2184 73.9017
frequency: 34.3001 45.1961 73.8951 84.8790 110.2197 147.6739 200.4815 216.5724 232.5936 237.9487 306.9184 338.4617 356.2191 404.5431 410.6261 417.7075 468.5116 486.4235 518.1841 576.4183 600.0071 614.4258 633.4311 664.7777 699.1722 701.8882 734.0813 741.4684 772.2336 781.0054 844.2040 849.6122 862.2588 919.1406 927.1741 961.0892 973.1771 985.9669 987.2533 991.3525 993.2849 996.3498 1017.1563 1040.0198 1080.2684 1084.3484 1106.3589 1136.3326 1150.8937 1173.0776 1185.0739 1196.2385 1223.9070 1236.8968 1286.1159 1289.4809 1301.8639 1308.4200 1331.7974 1371.5029 1379.0229 1382.5271 1411.0443 1438.8878 1448.3235 1472.0588 1473.5486 1480.9542 1516.1498 1569.5201 1588.8934 1612.9742 1621.5325 1668.5750 2839.9749 2979.5193 3075.0777 3100.5728 3108.9724 3121.6770 3124.6699 3127.2505 3138.4925 3140.7678 3148.0340 3149.0194 3164.4824 3338.4731 3453.1027 3522.8853
redmass: 3.9280 4.1903 3.7115 4.5914 3.8085 3.5791 2.2843 2.9604 1.2187 3.6219 3.3265 2.9198 1.7257 2.8497 2.9010 3.4612 3.8300 3.1784 3.0366 2.3531 2.9014 6.3880 5.8562 2.7247 3.3590 1.7457 1.3469 2.9697 2.0604 3.8024 1.4483 1.2503 1.3498 1.4514 1.5893 1.3731 1.4272 2.7031 1.8828 1.9153 1.3153 6.5005 2.6010 1.8896 2.4042 1.6271 1.6143 1.9349 3.5297 1.0523 1.1185 1.1451 1.5659 1.4876 1.7482 2.3067 1.3273 1.4930 1.5626 3.3859 2.5711 1.3358 3.6152 2.3802 1.1347 1.3761 1.1139 1.4380 2.8101 5.9211 6.5503 6.0589 6.3532 1.0654 1.0811 1.0371 1.0976 1.1000 1.0878 1.0844 1.0873 1.0871 1.0935 1.0934 1.0963 1.0961 1.1016 1.0493 1.0764 1.0909
irintensity: 0.2411 0.5466 0.3760 0.2980 1.1454 0.3971 9.8089 1.9343 1.4176 1.4495 5.7189 3.7647 12.6473 0.1497 0.0816 4.9867 4.0194 34.1656 17.4470 6.8660 49.1173 0.7372 11.7261 125.4188 8.4288 45.9562 164.2888 26.4284 62.0534 11.0998 25.1389 0.3971 16.8945 2.4775 15.7967 0.3236 0.1470 5.8490 7.8384 1.0826 0.1016 10.3417 0.1339 4.9435 10.9410 8.4834 6.3328 2.4335 35.3531 0.0260 0.1577 1.5647 2.3855 31.2951 4.1455 1.4102 4.4787 6.6742 8.4558 4.5840 7.4865 20.9606 7.7739 1.7645 15.9047 20.0297 12.5015 23.9367 6.0071 3.8185 0.5647 10.8006 0.1018 18.3306 81.7997 44.7377 46.9976 18.6003 21.4907 7.7756 4.9665 1.9110 16.2397 14.4865 33.3882 17.1604 26.8630 17.6662 2.6256 0.6700
temp: 298.150 k
press: 1.00000 atm
elementType: 7 7 6 6 6 6 6 6 6 6 6 6 6 6 6 6 1 1 1 1 1 1 1 1 1 1 1 1 1 1 1 1
symmnumber: 1
zpe: 699922.3 jmol-1
zpe.correction: 0.266586 hartree
zpe.thermalcorrener: 0.281206 hartree
zpe.thermalcorrenthalpy: 0.282150 hartree
zpe.thermalcorrgfe: 0.224345 hartree
zpe.sumelectzpe: -651.407427 hartree
zpe.sumelectthermal: -651.392807 hartree
zpe.sumelectthermalent: -651.391863 hartree
zpe.sumelectthermalfe: -651.449668 hartree
dipole: 0.0855 -1.4540 -0.6330
dipole: 1.5881
quadrupole: -87.1113 -91.0138 -96.8811
quadrupole: 8.9944 0.9229 3.6337
quadrupole: 4.5574 0.6549 -5.2124 8.9944 0.9229 3.6337
hfenergy: -651.674013 hartree
pointgroup: C01 [X(C14H16N2)]
dipole: -0.0329496 0.3672386 -0.5043991 debye
polarizability: 264.2275336|6.5595242|124.0104252|-2.6546045|-28.5951034|125.3914509 unknown
InChI: InChI=1S/C14H16N2/c1-11(16-15)12-7-9-14(10-8-12)13-5-3-2-4-6-13/h2-11,16H,15H2,1H3
charge 0 multiplicity 1
32 atoms
N  4.442484 -0.736956 0.448704
N  4.338479 -2.047964 -0.120975
C  3.778902 0.36719 -0.292457
C  2.255414 0.22885 -0.231087
C  -0.608476 0.075601 -0.07597
C  1.446533 0.61632 -1.326611
C  1.616671 -0.247106 0.94085
C  4.240077 1.711904 0.322038
C  0.039884 0.545076 -1.251211
C  0.21174 -0.321565 1.016973
C  -2.095891 -0.00202 0.005108
C  -2.916141 0.949159 -0.663587
C  -2.737421 -1.027735 0.75407
C  -4.323448 0.877837 -0.587714
C  -4.144591 -1.099287 0.833185
C  -4.946489 -0.146999 0.162022
H  4.075048 0.361216 -1.373895
H  1.921606 0.966976 -2.252134
H  2.243543 -0.555221 1.78553
H  3.748521 2.558812 -0.185713
H  5.335703 1.838935 0.224228
H  3.975445 1.748711 1.39347
H  -0.560985 0.821689 -2.125165
H  -0.258877 -0.662788 1.946297
H  5.424541 -0.529409 0.668076
H  -2.447249 1.768087 -1.221029
H  -2.130534 -1.79193 1.253063
H  -4.933702 1.627303 -1.104445
H  -4.615608 -1.903481 1.409808
H  4.417257 -2.069208 -1.152211
H  3.487521 -2.51885 0.204773
H  -6.039055 -0.202451 0.222308
