program: Gaussian 09
title: 000053223
version: EM64L-G09RevD.01
frameworkgroup: C1[X(C10H10Cl2O6)]
method: RPBEPBE
basis: SDD
operation: Freq
keyword: #p
keyword: freq=noraman
keyword: PBEPBE/SDD
title: #p freq=noraman PBEPBE/SDD
converged: YES YES NO NO
title: Mulliken charges:
elementType: Cl Cl O O O O O O C C C C C C C C C C H H H H H H H H H H
charge: 0.008797 -0.013377 -0.326784 -0.263766 -0.412685 -0.422727 -0.399112 -0.208882 1.044548 -0.386821 -0.638486 -0.736565 0.381970 0.363182 0.007976 0.152251 -0.510869 -0.514702 0.292039 0.364760 0.387151 0.228638 0.241889 0.249819 0.220633 0.267337 0.238083 0.385701
chargesum: 0.00000
title: Mulliken charges with hydrogens summed into heavy atoms:
elementType: Cl Cl O O O O O O C C C C C C C C C C
charge: 0.008797 -0.013377 -0.326784 -0.263766 -0.047925 -0.035575 -0.013411 -0.208882 1.044548 -0.094782 -0.638486 -0.736565 0.381970 0.363182 0.007976 0.152251 0.209477 0.211351
polarizability: 1.86549842e+02 -8.20977046e+00 1.84255532e+02 7.06301664e+00 1.32420366e+00 9.18290797e+01
1716.lowfreq: -6.3282 -0.0015 0.0010 0.0016 4.0810 8.2626 35.7370 44.9278 54.6374
frequency: 35.7262 44.9147 54.6046 67.4609 74.4174 81.2363 112.4032 121.6771 144.9143 149.4064 169.9483 183.2166 201.5232 210.5291 212.1914 238.5565 260.6016 289.7214 314.0586 320.2143 333.7585 363.9301 375.0710 417.7650 425.7746 447.0327 490.2383 504.0486 594.7849 602.0896 608.9020 641.6262 656.6258 682.6650 721.5821 738.4891 811.3502 842.3525 857.2054 890.4834 929.5879 995.3555 1032.6957 1054.7592 1062.7339 1112.9123 1113.6213 1149.1267 1151.7931 1169.7591 1238.6146 1245.2076 1277.2659 1294.3188 1311.5055 1377.6169 1387.2128 1403.3985 1422.0485 1439.2438 1448.8242 1456.6550 1459.2522 1476.8984 1477.4798 1581.9235 1583.5473 1664.9390 2987.1341 2990.2104 3051.8723 3096.0087 3101.2652 3135.6399 3140.6517 3421.1144 3516.2721 3523.6475
redmass: 7.2388 4.2046 3.1040 5.7735 3.4003 4.3816 2.2800 5.0589 2.0274 1.4520 5.2992 2.8624 4.9582 4.3599 4.7992 5.9387 5.8007 8.7353 6.0102 4.7560 3.3457 9.3867 7.9557 8.2988 5.6421 5.6222 5.1120 6.6118 1.7978 3.0854 1.3527 3.1701 8.7842 6.6488 7.8320 6.5335 9.3983 7.1742 7.8108 6.7711 9.5750 7.0786 5.0266 5.4213 2.8415 1.2376 1.2331 1.5075 1.4439 3.6575 1.8444 1.3055 1.6336 3.2745 3.0125 3.6724 2.4473 1.5418 1.9411 1.3104 1.6539 1.0515 1.2012 1.0535 1.0556 6.7408 10.7903 9.5763 1.0318 1.0329 1.0821 1.1025 1.0998 1.1042 1.1053 1.0633 1.0642 1.0651
irintensity: 0.7378 5.0145 2.8481 1.7613 1.3866 3.6521 0.9839 0.4696 0.9687 1.0980 4.0437 43.3679 11.9361 41.2409 9.6718 26.0787 4.5940 0.2496 14.2021 7.9477 94.3894 1.3632 2.6111 0.8283 10.8525 2.6048 17.8673 1.8572 132.2356 91.6063 65.7271 35.8085 8.5489 12.7708 71.8686 5.1039 2.9752 30.5944 35.6740 13.9138 92.4519 198.7313 40.2899 136.4109 72.5247 8.4183 4.0954 3.4036 9.0882 10.8857 290.7332 36.8838 130.7302 93.2559 30.7549 26.1596 67.4023 40.6689 59.5538 47.1384 78.8945 9.7666 8.2790 32.5887 4.9049 5.4615 23.4228 235.0378 61.0519 65.6125 14.7136 22.4844 28.5898 14.5573 10.8567 95.6414 30.0342 21.6642
temp: 298.150 k
press: 1.00000 atm
elementType: 17 17 8 8 8 8 8 8 6 6 6 6 6 6 6 6 6 6 1 1 1 1 1 1 1 1 1 1
symmnumber: 1
zpe: 499890.8 jmol-1
zpe.correction: 0.190398 hartree
zpe.thermalcorrener: 0.209979 hartree
zpe.thermalcorrenthalpy: 0.210923 hartree
zpe.thermalcorrgfe: 0.141411 hartree
zpe.sumelectzpe: -1757.115805 hartree
zpe.sumelectthermal: -1757.096224 hartree
zpe.sumelectthermalent: -1757.095280 hartree
zpe.sumelectthermalfe: -1757.164792 hartree
dipole: 4.3229 -1.3872 2.6191
dipole: 5.2413
quadrupole: -113.6131 -109.4645 -117.0500
quadrupole: 0.6985 -4.4950 -11.6523
quadrupole: -0.2372 3.9114 -3.6742 0.6985 -4.4950 -11.6523
hfenergy: -1757.3062031 hartree
pointgroup: C01 [X(C10H10Cl2O6)]
dipole: -1.736582 -0.453512 -1.015326 debye
polarizability: 187.3168603|7.8948843|183.7197204|5.5421612|1.5496729|91.5978731 unknown
InChI: InChI=1S/C10H10Cl2O6/c1-17-8-4(11)3(6(13)10(15)16)5(12)9(18-2)7(8)14/h6,13-15H,1-2H3
charge 0 multiplicity 1
28 atoms
Cl 1.834756 2.207046 0.092998
Cl -0.021512 -3.070744 0.659506
O  -2.76981 -1.662012 0.236966
O  -1.00069 2.841729 -0.204343
O  2.866784 -0.324478 1.748645
O  -3.210875 0.946988 -0.105367
O  2.594953 -1.272496 -1.801207
O  4.242697 -0.077889 -0.672636
C  0.805547 -0.389547 0.338279
C  2.242434 -0.874773 0.560132
C  0.492384 0.981246 0.159745
C  -0.287883 -1.289834 0.365781
C  -1.613168 -0.847583 0.201092
C  -0.827698 1.482774 0.032374
C  -1.886285 0.53687 0.051531
C  3.144535 -0.667711 -0.67236
C  -2.954516 -2.587553 -0.914319
C  -2.0454 3.562093 0.564128
H  2.200802 -1.963206 0.737688
H  3.301674 0.537472 1.513164
H  -3.776226 0.131682 0.018787
H  -2.941456 -2.024955 -1.866209
H  -3.93897 -3.050779 -0.752089
H  -2.168667 -3.360164 -0.916309
H  -1.866394 3.447571 1.649278
H  -3.049557 3.194846 0.301974
H  -1.920703 4.614518 0.270559
H  3.201146 -1.144212 -2.58029
