program: Gaussian 09
title: 000053195
version: EM64L-G09RevD.01
frameworkgroup: C1[X(C9H11Cl2NO3)]
method: RPBEPBE
basis: SDD
operation: Freq
keyword: #p
keyword: freq=noraman
keyword: PBEPBE/SDD
title: #p freq=noraman PBEPBE/SDD
converged: YES YES NO NO
title: Mulliken charges:
elementType: Cl Cl O O O N C C C C C C C C C H H H H H H H H H H H
charge: -0.003095 0.035994 -0.224972 -0.442332 -0.284712 -0.105054 -0.593131 -0.395643 0.437873 -0.291446 0.354473 -0.404073 -0.720377 -0.188583 -0.057849 0.268833 0.247844 0.203530 0.271693 0.182054 0.212903 0.265595 0.268655 0.315166 0.274019 0.372638
chargesum: 0.00000
title: Mulliken charges with hydrogens summed into heavy atoms:
elementType: Cl Cl O O O N C C C C C C C C C
charge: -0.003095 0.035994 -0.224972 -0.069694 -0.284712 -0.105054 -0.076455 0.079579 0.437873 0.103510 0.354473 -0.138478 -0.136557 0.085436 -0.057849
polarizability: 1.50720370e+02 -2.32252989e+00 1.46913950e+02 -2.95398458e+00 -1.32803689e+01 8.94905380e+01
1716.lowfreq: -6.4021 -2.8924 -0.0034 -0.0029 -0.0027 4.8711 20.4369 30.4703 38.3274
frequency: 20.4338 30.4673 38.3199 54.4106 70.8560 112.4821 127.3180 151.4931 155.9312 215.8178 218.9813 267.0912 293.2935 320.5686 373.8765 375.8869 447.7165 454.1416 478.1506 557.9355 587.5512 592.7380 639.0035 689.9601 729.1241 734.1503 758.1535 800.4974 845.2494 863.3650 880.3504 897.3195 909.1210 932.0520 957.5356 1013.7952 1016.7769 1046.0167 1056.6725 1092.7642 1133.0829 1172.2877 1173.1081 1203.0067 1210.0907 1226.7109 1268.4405 1286.1730 1325.9650 1342.6697 1346.9835 1352.3197 1403.8685 1425.1055 1429.7051 1450.4492 1465.4260 1471.6287 1505.9444 1589.8745 1598.7444 2931.9910 3003.3033 3019.7593 3035.8980 3046.2564 3068.7278 3076.0913 3117.2974 3222.3902 3251.9794 3345.6298
redmass: 9.5492 9.9773 4.2709 5.1665 6.0297 3.0189 9.7875 4.5694 6.4354 5.7762 3.8720 7.5066 5.5025 4.8754 3.2815 5.5571 5.3070 2.2472 3.1310 3.2697 5.8856 4.0931 4.4914 1.1129 5.0466 4.1745 5.7533 1.2476 2.8393 1.4389 2.8160 4.5077 6.4396 1.8529 2.1687 2.4298 1.7287 2.5625 2.5089 6.6602 2.6680 1.0934 1.7299 1.5202 1.3880 1.9930 1.3980 1.3922 2.1280 1.4558 1.2781 1.3191 2.0665 1.1961 1.0928 1.1370 1.0880 1.1617 8.1939 6.7707 6.4628 1.0695 1.0601 1.0611 1.0577 1.0946 1.1021 1.1014 1.1068 1.0967 1.1027 1.0660
irintensity: 1.8914 2.0205 1.1880 1.3243 1.3658 5.5268 1.5044 4.2893 6.8404 0.6796 2.0747 0.5020 0.7965 16.2721 2.4948 1.1712 8.3165 3.1111 8.6332 0.6951 5.7428 0.6602 10.4844 158.5322 14.2571 23.9152 45.8845 64.6225 0.2485 0.8345 1.2263 27.5349 1.1682 6.4007 22.8122 32.9922 24.2075 85.6553 37.7834 76.4014 24.6653 0.8392 36.0119 43.3496 14.7361 41.0170 6.9672 39.1249 15.3775 21.9855 31.8634 14.6790 65.6674 160.8971 5.3176 24.6280 12.9497 5.7057 87.1755 89.9708 106.3350 74.2928 18.8874 16.3106 12.0495 50.2359 13.5776 17.4374 1.8447 2.0486 0.9046 219.7191
temp: 298.150 k
press: 1.00000 atm
elementType: 17 17 8 8 8 7 6 6 6 6 6 6 6 6 6 1 1 1 1 1 1 1 1 1 1 1
symmnumber: 1
zpe: 504275.5 jmol-1
zpe.correction: 0.192068 hartree
zpe.thermalcorrener: 0.207513 hartree
zpe.thermalcorrenthalpy: 0.208458 hartree
zpe.thermalcorrgfe: 0.145774 hartree
zpe.sumelectzpe: -1548.910989 hartree
zpe.sumelectthermal: -1548.895544 hartree
zpe.sumelectthermalent: -1548.894600 hartree
zpe.sumelectthermalfe: -1548.957284 hartree
dipole: 5.8347 -3.9407 4.4398
dipole: 8.3237
quadrupole: -122.8671 -100.4962 -100.9405
quadrupole: -5.7544 -10.8692 -3.3582
quadrupole: -14.7658 7.6050 7.1608 -5.7544 -10.8692 -3.3582
hfenergy: -1549.1030578 hartree
pointgroup: C01 [X(C9H11Cl2N1O3)]
dipole: 2.382424 1.7746883 -1.3780246 debye
dipolederiv: -0.1518025 -0.1090985 -0.0176563 -0.1136692 -0.4131529 -0.0133604 0.0049908 0.0332841 -0.1120134 -0.2843779 0.1949791 -0.1662008 0.3395782 -0.3565111 0.1966695 -0.2168311 0.1519421 -0.0868762 -0.5722726 -0.0528307 -0.2328964 -0.082814 -0.6410363 0.0359486 -0.2635954 0.0418937 -0.2034824 -0.7637621 -0.0200609 0.0352066 -0.041581 -0.5456297 0.0634385 0.0294696 0.0813576 -0.5647168 -1.0283231 -0.1410788 0.280998 -0.0859607 -0.6718608 -0.0575244 0.4969484 0.1190003 -0.5247496 -0.8310055 -0.0939643 -0.0234839 -0.4314111 -0.9909517 0.0283222 0.1518798 0.0047535 -0.3660662 0.864929 0.1440992 -0.0054663 0.124299 0.1213519 -0.0446923 -0.1134084 -0.0772408 0.3268406 0.0655993 -0.1313342 0.0037268 -0.1784178 0.349792 0.1085038 -0.1164345 0.1855616 0.2134325 -0.0015195 0.0460152 0.0814313 -0.0209767 0.3626243 -0.0428563 0.0559906 0.0099551 -0.1092417 0.4479288 0.0672978 -0.0786311 0.0963571 0.358538 -0.12702 -0.0281032 -0.1008125 0.4142323 0.9190465 0.2068358 -0.3680248 0.6882578 1.2564212 0.0022914 -0.4482587 0.0360116 0.429919 -0.0358761 -0.0920925 0.1050537 -0.0227779 -0.062279 -0.027256 0.0971404 -0.0661678 -0.1175727 0.0858557 0.3334716 0.106303 0.2173533 0.4399971 -0.1110227 0.0509484 -0.2599724 0.0604226 -0.1691397 0.0830142 0.0162502 0.1324609 -0.2583159 0.0662353 -0.0202223 0.0597984 -0.1524459 0.6357318 -0.2703472 0.3850365 -0.3300175 0.8158427 -0.2361354 0.4168284 -0.2591807 0.1993403 -0.0057504 -0.0085116 -0.0154195 -0.0187611 -0.0685874 0.1156178 0.0077285 0.0460434 0.0830499 -0.0515824 0.0051173 -0.0172984 -0.0255297 0.0275962 -0.1475678 -0.0017143 -0.0890125 0.006647 -0.0383621 -0.10056 0.0335004 -0.1042807 -0.0589843 -0.0002747 0.0561649 0.0255906 0.0810103 0.0528929 0.0414335 -0.0019615 0.0478844 0.0222317 0.0581748 -0.0276164 -0.0301208 -0.0721867 -0.0035905 -0.0276552 0.0147904 -0.0314243 0.0531653 -0.0210498 -0.0156327 0.0487674 -0.2564537 0.039437 0.0225161 0.0210057 0.0305698 -0.1764899 -0.0249598 0.0140021 -0.0773032 0.0616073 0.1347133 0.0615901 -0.0485555 0.0514316 0.0123592 0.0428991 -0.0457115 0.0493531 0.1571388 0.0947818 -0.0133446 0.0099975 -0.0252084 -0.049705 0.0723515 0.0362022 0.0499136 -0.0545701 -0.0013833 -0.0086924 -0.0029458 -0.0126219 -0.0100522 0.0070277 -0.0130256 0.0112499 0.089356 0.0537495 -0.0393071 -0.0741629 -0.0382567 0.1192845 -0.0105042 -0.086068 -0.0109434 0.1668168 0.5440824 -0.097492 -0.040597 -0.1644835 0.364352 0.0667434 -0.0216718 0.0162784 0.3305621 unknown
polarizability: 149.5902812|2.6375579|149.1219512|8.6993892|-6.8263688|88.4126252 unknown
InChI: InChI=1S/C9H11Cl2NO3/c10-5-9(14)12(3-4-13)6-7-1-2-8(11)15-7/h1-2,13H,3-6H2
charge 0 multiplicity 1
26 atoms
Cl -1.702008 -3.645797 -0.560946
Cl 4.059236 -1.35673 1.287165
O  1.909186 -0.377611 -0.022921
O  -4.081926 1.200419 1.106736
O  -2.655217 -1.077532 0.602953
N  -1.125168 0.413797 -0.29247
C  0.019854 0.739404 -1.184835
C  -1.649923 1.513402 0.571538
C  1.34401 0.844008 -0.487763
C  -3.120967 1.927475 0.294283
C  -1.65078 -0.861121 -0.142406
C  2.190275 1.888449 -0.155396
C  -0.947186 -1.988324 -0.92031
C  3.333821 1.331465 0.541957
C  3.115892 -0.030351 0.598771
H  -0.183853 1.711665 -1.668116
H  0.075591 -0.007436 -1.995102
H  -0.97626 2.375169 0.416595
H  -1.575123 1.213818 1.63428
H  -3.328792 1.824703 -0.794882
H  -3.248686 2.989623 0.570937
H  2.028351 2.94076 -0.382459
H  -1.044835 -1.843658 -2.008809
H  0.116006 -2.057965 -0.644355
H  4.191057 1.865681 0.942692
H  -3.818355 0.233187 1.069763
