program: Gaussian 09
title: 000006798
version: EM64L-G09RevD.01
frameworkgroup: C1[X(C13H13I3N2O4)]
method: RPBEPBE
basis: SDD
operation: Freq
keyword: #p
keyword: freq=noraman
keyword: PBEPBE/SDD
title: #p freq=noraman PBEPBE/SDD
converged: NO YES NO NO
title: Mulliken charges:
elementType: I I I O O O O N N C C C C C C C C C C C C C H H H H H H H H H H H H H
charge: 0.144292 0.162358 0.178450 -0.204040 -0.207602 -0.361192 -0.179192 -0.510951 -0.517392 0.835410 0.813421 -0.766503 0.702830 -0.794166 -0.756744 0.232753 0.246335 -0.498997 -0.499756 -0.030591 -0.665131 -0.667190 0.311907 0.323214 0.212267 0.249433 0.248032 0.216383 0.255024 0.215102 0.224580 0.223943 0.215551 0.255359 0.392804
chargesum: 0.00000
title: Mulliken charges with hydrogens summed into heavy atoms:
elementType: I I I O O O O N N C C C C C C C C C C C C C
charge: 0.144292 0.162358 0.178450 -0.204040 -0.207602 0.031612 -0.179192 -0.199044 -0.194178 0.835410 0.813421 -0.766503 0.702830 -0.794166 -0.756744 0.232753 0.246335 -0.037297 -0.035341 -0.030591 0.029574 0.027662
polarizability: 3.23764356e+02 -2.76797514e+00 2.97236666e+02 -4.84390054e-01 -5.26388062e+00 1.40972637e+02
1716.lowfreq: -7.2176 -2.3379 0.0004 0.0006 0.0007 3.5934 14.4289 23.2996 24.6160
frequency: 12.8451 23.2322 24.5638 32.4350 41.7680 50.6019 59.4459 62.2377 63.1622 70.8912 84.4580 97.6737 103.6893 112.4611 125.9438 154.0122 163.5991 186.2461 188.7235 201.4905 209.1981 234.4261 254.8833 268.0823 283.1300 312.3717 322.9781 361.0195 397.7440 417.2012 466.6430 501.4184 521.6309 533.8695 542.6652 556.7028 605.6749 610.1636 627.9628 643.8394 650.7330 660.7935 705.3655 711.6756 738.3101 788.7742 796.4201 799.6620 895.4582 909.3337 915.2524 987.9470 1012.7586 1024.8071 1038.3348 1054.8212 1074.6146 1079.6149 1080.3448 1092.4854 1165.3908 1171.2633 1247.5642 1253.3478 1256.1979 1303.5484 1330.4654 1335.7062 1341.2232 1362.0353 1365.5092 1392.2362 1392.6611 1441.4080 1444.4268 1445.6653 1447.3692 1470.7997 1471.4750 1485.7447 1486.3120 1531.7963 1535.3805 1645.5124 1646.9131 1648.1538 2973.6461 2976.4464 2996.6384 2997.0355 3025.6761 3030.1875 3091.6743 3092.7392 3107.1221 3107.1867 3501.5700 3501.8215 3515.2960
redmass: 3.0183 6.3597 5.6344 3.7737 8.8336 8.4812 9.2708 6.3182 2.8558 2.3326 10.2433 27.9799 18.3295 7.4372 9.6035 8.7081 54.4620 1.8271 2.1086 1.8169 2.4271 3.9679 4.4230 4.6536 4.4480 6.2955 5.5006 6.8053 4.7777 9.5678 3.6204 1.3898 1.4628 3.2431 2.5112 3.0171 3.5475 3.8026 3.0787 4.7196 5.4252 6.0487 4.1397 5.7044 7.2898 6.8878 1.3773 1.3981 5.4579 4.5621 6.9258 3.9722 3.4449 3.5085 1.9298 2.4929 1.7805 1.8469 2.0823 2.7709 2.3813 2.3487 1.8975 1.3183 1.2889 6.6152 1.9781 1.8004 3.3849 5.0131 7.0125 1.1978 1.1989 1.6893 1.1878 1.2070 1.7050 1.0460 1.0448 1.0514 1.0524 9.4889 7.5388 6.7298 10.1108 6.8145 1.0595 1.0593 1.0363 1.0362 1.1001 1.1001 1.1007 1.1008 1.1002 1.1002 1.0760 1.0643 1.0765
irintensity: 0.3029 0.5694 1.2446 0.2403 2.5159 5.0945 1.6518 2.3813 2.0894 2.1911 3.4683 2.4089 1.7621 1.6281 0.0810 1.7559 0.3012 0.4149 0.0796 3.0732 0.8342 3.7073 1.8109 14.1834 5.8592 6.2629 4.1566 2.3199 0.7492 2.9566 12.7034 79.2748 61.7076 35.5726 48.4642 33.6528 39.0211 22.0970 26.2207 58.0680 5.2978 13.7560 7.2081 10.7249 22.0458 9.1787 10.5428 16.1931 20.0618 14.6855 12.7198 50.7189 49.2036 1.0246 9.2681 164.8616 98.5883 14.2568 15.3740 9.9712 96.1348 172.1085 13.0040 3.8225 4.5300 48.0955 11.4307 4.1511 14.1926 121.7174 303.7675 19.3345 23.3915 246.4217 94.9761 132.3681 194.5332 11.4117 11.4511 18.3183 14.7122 7.1090 26.9032 34.1069 252.2864 150.1833 23.3208 19.8327 30.0616 33.5518 14.8057 15.8093 38.7071 33.0160 15.7434 21.3874 34.3273 31.6566 23.4053
temp: 298.150 k
press: 1.00000 atm
elementType: 53 53 53 8 8 8 8 7 7 6 6 6 6 6 6 6 6 6 6 6 6 6 1 1 1 1 1 1 1 1 1 1 1 1 1
symmnumber: 1
zpe: 634521.7 jmol-1
zpe.correction: 0.241677 hartree
zpe.thermalcorrener: 0.267105 hartree
zpe.thermalcorrenthalpy: 0.268050 hartree
zpe.thermalcorrgfe: 0.178848 hartree
zpe.sumelectzpe: -946.488844 hartree
zpe.sumelectthermal: -946.463415 hartree
zpe.sumelectthermalent: -946.462471 hartree
zpe.sumelectthermalfe: -946.551673 hartree
dipole: 1.5774 1.3841 -4.0136
dipole: 4.5291
quadrupole: -143.7246 -157.7402 -184.8485
quadrupole: -7.0715 -0.6116 -16.7032
quadrupole: 18.3798 4.3643 -22.7441 -7.0715 -0.6116 -16.7032
hfenergy: -946.7305205 hartree
pointgroup: C01 [X(C13H13I3N2O4)]
dipole: 0.5709598 0.4741547 -1.6199863 debye
polarizability: 323.9092064|1.5941362|294.5575711|4.1060606|-20.0390116|143.5068819 unknown
InChI: InChI=1S/C13H13I3N2O4/c1-3-5(19)17-11-8(14)7(13(21)22)9(15)12(10(11)16)18-6(20)4-2/h17-18,21H,3-4H2,1-2H3
charge 0 multiplicity 1
35 atoms
I  0.252462 2.74005 -1.403543
I  2.994361 -2.564747 0.102181
I  -3.116174 -2.31341 -0.478398
O  -3.175881 0.556701 1.361569
O  2.439005 1.935194 1.171801
O  -0.347682 -3.855585 1.362409
O  -0.033262 -4.433094 -0.869911
N  -2.33368 0.880548 -0.798488
N  2.607187 0.552239 -0.705552
C  -1.159492 0.094517 -0.647547
C  1.322801 -0.053262 -0.59195
C  0.128283 0.688093 -0.791715
C  -0.055129 -2.071425 -0.204217
C  1.204635 -1.436077 -0.279584
C  -1.229986 -1.305316 -0.402075
C  -3.276977 1.098388 0.231027
C  3.12349 1.486568 0.21653
C  -4.440726 2.007072 -0.174897
C  4.584856 1.8725 -0.039343
C  -0.14152 -3.562451 0.017957
C  -4.954752 2.848471 1.010994
C  4.880403 3.323454 0.391603
H  -2.374022 1.509084 -1.60586
H  3.260322 0.143447 -1.379293
H  -4.156956 2.656963 -1.025757
H  -5.251035 1.343763 -0.540954
H  5.213417 1.17532 0.551671
H  4.849081 1.71807 -1.103472
H  -5.165754 2.194726 1.873446
H  -5.879097 3.386079 0.735973
H  -4.201502 3.590666 1.328798
H  4.348427 4.045686 -0.252476
H  5.962336 3.535395 0.332878
H  4.540575 3.485204 1.427964
H  -0.413216 -4.84273 1.484935
