program: Gaussian 09
title: 000053200
version: EM64L-G09RevD.01
frameworkgroup: C1[X(C22H26N2O3)]
method: RPBEPBE
basis: SDD
operation: Freq
keyword: #p
keyword: freq=noraman
keyword: PBEPBE/SDD
title: #p freq=noraman PBEPBE/SDD
converged: NO YES NO NO
title: Mulliken charges:
elementType: O O O N N C C C C C C C C C C C C C C C C C C C C C C H H H H H H H H H H H H H H H H H H H H H H H H H H
charge: -0.245595 -0.301359 -0.299450 -0.084867 -0.421835 -0.471009 -0.168492 -0.498216 0.328745 -0.032923 -0.567419 0.374090 0.482249 0.047750 0.309806 -0.566013 -0.714099 -0.729738 -0.560449 -0.455768 0.205367 0.187680 -0.426378 -0.260379 -0.224033 -0.529905 -0.530688 0.247721 0.226930 0.232629 0.227588 0.230733 0.261609 0.220308 0.272557 0.315444 0.213772 0.212290 0.229293 0.196358 0.213452 0.247927 0.258572 0.240759 0.241090 0.231416 0.230667 0.218826 0.253455 0.227580 0.228175 0.220540 0.253237
chargesum: 0.00000
title: Mulliken charges with hydrogens summed into heavy atoms:
elementType: O O O N N C C C C C C C C C C C C C C C C C C C C C C
charge: -0.245595 -0.301359 -0.299450 -0.084867 -0.106391 -0.223288 0.058438 -0.037999 0.328745 0.197810 -0.085502 0.374090 0.482249 0.047750 0.309806 -0.293456 -0.058744 -0.072001 -0.301877 -0.215009 0.205367 0.187680 -0.185288 -0.028963 0.006634 0.169956 0.171264
polarizability: 2.83530806e+02 6.65862325e+00 2.83467138e+02 -1.07221022e+01 -6.38913390e+00 2.05613838e+02
1716.lowfreq: -10.5214 -4.8975 0.0005 0.0006 0.0007 3.1538 25.0357 38.7019 49.9855
frequency: 24.9314 38.6959 49.9805 55.4962 63.3620 76.9185 99.9935 105.0301 117.9054 127.3372 143.6459 156.2388 161.6204 168.9509 189.3748 197.4888 208.2261 233.5865 248.2068 252.3461 258.6091 275.6822 293.7955 309.4274 330.8731 342.4781 360.3727 368.9009 388.6279 397.0502 407.2792 433.4475 449.7012 487.8883 494.2652 499.5768 505.3388 528.6156 556.7691 568.6081 598.2973 624.4701 639.0468 650.7778 674.9520 700.2198 708.2298 718.2328 744.2574 746.6051 763.2233 804.7844 811.1172 844.4565 857.4479 866.2221 879.6041 888.3581 900.2546 901.1904 914.4300 920.6232 941.9216 947.3878 950.8232 960.1956 961.4487 965.6467 985.4081 1031.2977 1043.9332 1064.0055 1093.1685 1112.7595 1113.5536 1115.0295 1120.1820 1120.5913 1140.2615 1147.2710 1149.9917 1159.9083 1170.9731 1172.7944 1174.1920 1201.7562 1211.2605 1228.5993 1231.1633 1246.3122 1255.7158 1262.8016 1268.2124 1300.8067 1304.9006 1313.4418 1322.4188 1336.5215 1339.2053 1351.1027 1364.3762 1369.0763 1371.6391 1376.6818 1385.1114 1393.2378 1409.3314 1423.3406 1442.1692 1456.9111 1457.8148 1458.1631 1460.0718 1464.3170 1466.1346 1469.5733 1477.2010 1477.5537 1484.9178 1487.6377 1490.6037 1492.2498 1562.0362 1589.6228 1608.7923 1613.3597 1614.7247 2938.7883 2966.6984 2967.3086 2968.2447 2970.6610 2972.1065 2978.5704 3009.2267 3023.5906 3025.8164 3051.7600 3059.1626 3064.1685 3067.1326 3070.8213 3072.5586 3084.7370 3117.3696 3118.7895 3122.7260 3127.5135 3138.4789 3144.1383 3145.8467 3166.9786 3499.0782
redmass: 4.9116 4.4347 4.2400 2.6997 3.7100 4.1739 5.2758 2.7810 3.7591 3.9727 2.5932 1.8939 1.7226 1.1704 3.5527 1.1366 3.7867 2.5181 1.8125 2.6670 3.6269 4.7959 2.4804 3.7834 3.7288 4.5198 3.0371 4.7512 5.0974 4.2800 3.1538 3.6437 2.9166 4.9333 4.0685 4.6629 3.6909 4.3053 3.7753 3.6477 1.6632 4.9985 4.9229 6.3301 5.1995 3.7204 3.8791 4.6382 3.5600 3.7415 1.3923 3.4572 3.1911 2.3314 2.4374 2.7803 2.1156 1.6551 2.3956 3.9529 1.5971 1.3031 2.3453 1.9365 2.5730 2.6059 2.5405 1.9605 1.3292 2.6107 2.1327 4.2211 3.1519 1.9758 1.2461 1.2505 2.3663 2.2154 2.1128 1.9209 1.4911 1.5686 1.9034 2.0912 1.0930 1.3849 2.1538 1.6276 1.9299 1.5329 1.4470 1.5330 3.4852 1.4495 1.5054 1.6335 1.7853 1.8122 1.7719 1.4668 1.6407 1.9542 1.4988 2.4909 2.6755 1.2142 2.2469 1.1749 1.3162 1.0674 1.3273 1.7807 1.0988 1.0694 1.0986 1.0508 1.0506 1.0557 2.8115 1.0536 1.0691 2.6694 8.5758 7.2886 5.1943 5.9161 6.8805 1.0831 1.0367 1.0619 1.0311 1.0313 1.0362 1.0638 1.0828 1.0977 1.0864 1.1018 1.0988 1.1035 1.1033 1.0984 1.0987 1.0991 1.1027 1.1028 1.0871 1.0894 1.0913 1.0909 1.0931 1.1005 1.0754
irintensity: 0.2236 0.5467 0.1513 0.0306 0.8596 1.7773 3.8345 6.8358 2.3409 0.3679 1.8281 1.9507 0.7287 0.6757 0.9591 0.1949 7.7500 0.9378 0.2348 4.9861 4.0875 4.5402 1.2074 2.4792 1.4085 1.3960 3.0246 3.6917 1.2985 2.7004 0.2685 2.4889 4.3002 1.5860 8.3657 2.4935 7.7421 13.3217 17.4964 2.4632 69.5042 5.0610 13.2708 6.7445 9.5560 9.5515 13.4297 40.6353 7.0130 7.9810 92.2645 3.0354 6.2322 3.0142 3.7067 0.5974 2.6300 8.2768 19.1459 14.1656 2.9374 12.6948 8.2456 12.1819 27.5638 47.1167 20.0923 27.6242 0.2323 13.6549 5.7756 23.6490 47.6117 34.0764 15.3167 2.5334 6.5438 61.3886 6.4327 12.3805 9.8694 12.6442 11.9328 28.8430 2.2461 8.5685 8.9603 12.2800 6.0654 9.5785 87.2806 37.4637 93.6662 1.1999 11.7212 19.1259 21.3305 11.4519 85.7767 6.5128 3.4900 20.8245 13.8520 8.5263 12.8072 23.3417 3.4643 0.4832 8.4073 10.2394 9.8891 26.2575 17.7331 10.2794 7.9589 2.4637 4.0340 4.2443 159.7748 26.5876 5.0832 70.4312 3.4506 113.3340 136.2330 63.2599 18.7408 21.2826 32.4414 28.1955 78.1342 75.4957 29.8138 46.4947 0.6704 41.7757 9.7174 39.9583 10.0019 30.0967 25.1116 56.3653 50.5748 24.5038 25.0694 26.7914 6.6102 3.0778 8.1599 1.7172 18.1297 26.8793 21.3217
temp: 298.150 k
press: 1.00000 atm
elementType: 8 8 8 7 7 6 6 6 6 6 6 6 6 6 6 6 6 6 6 6 6 6 6 6 6 6 6 1 1 1 1 1 1 1 1 1 1 1 1 1 1 1 1 1 1 1 1 1 1 1 1 1 1
symmnumber: 1
zpe: 1145360.5 jmol-1
zpe.correction: 0.436245 hartree
zpe.thermalcorrener: 0.461765 hartree
zpe.thermalcorrenthalpy: 0.462709 hartree
zpe.thermalcorrgfe: 0.381615 hartree
zpe.sumelectzpe: -1187.100567 hartree
zpe.sumelectthermal: -1187.075047 hartree
zpe.sumelectthermalent: -1187.074103 hartree
zpe.sumelectthermalfe: -1187.155197 hartree
dipole: -0.1564 2.4638 -1.7543
dipole: 3.0286
quadrupole: -150.9538 -149.5194 -160.9388
quadrupole: 3.6084 -0.8716 13.2996
quadrupole: 2.8502 4.2846 -7.1348 3.6084 -0.8716 13.2996
hfenergy: -1187.5368114 hartree
pointgroup: C01[X(C22H26N2O3)]
dipole: 0.0054166 -0.9882668 -0.6656472 debye
polarizability: 284.109442|6.8197887|282.8111049|12.0275144|3.8150144|205.6912347 unknown
InChI: InChI=1S/C22H26N2O3/c1-13(2)20-22(25)23-17-8-6-5-7-15(17)21-16-12-19(27-4)18(26-3)11-14(16)9-10-24(20)21/h5-8,11-13,20-21,23H,9-10H2,1-4H3
charge 0 multiplicity 1
53 atoms
O  -1.19011 1.809527 2.405377
O  3.730797 -1.882058 0.034911
O  4.851736 0.771738 0.591662
N  -1.470189 1.405019 -1.072096
N  -1.307362 -0.339453 1.574585
C  -0.630307 0.186821 -1.257114
C  -2.249937 1.554219 0.193069
C  -0.714577 2.618893 -1.476297
C  0.811056 0.338847 -0.691146
C  -3.722132 1.028464 0.06515
C  0.50459 2.88468 -0.561102
C  1.351746 1.626338 -0.411163
C  -1.309577 -1.095306 -0.781196
C  -1.529657 1.035144 1.460073
C  -1.555768 -1.345593 0.598474
C  1.631876 -0.803712 -0.534475
C  -4.482168 1.173202 1.4051
C  -4.442271 1.800913 -1.061971
C  2.700563 1.729202 0.00573
C  -1.617926 -2.114968 -1.710709
C  2.965007 -0.696486 -0.095496
C  3.517567 0.592597 0.153325
C  -2.040095 -2.607699 1.023115
C  -2.116633 -3.370516 -1.297243
C  -2.310541 -3.621349 0.080423
C  4.176021 -2.171443 1.417612
C  5.882818 0.333291 -0.377214
H  -0.511336 0.07766 -2.35671
H  -2.331344 2.641591 0.382859
H  -1.402561 3.483305 -1.478583
H  -0.373819 2.465345 -2.519929
H  -3.694558 -0.040712 -0.215111
H  0.149074 3.211371 0.437168
H  1.118645 3.712107 -0.966642
H  1.242784 -1.807957 -0.733832
H  -0.937535 -0.629296 2.485856
H  -4.491269 2.227075 1.743925
H  -5.531477 0.846434 1.285886
H  -4.029088 0.566411 2.210301
H  -4.580749 2.864643 -0.784204
H  -5.44262 1.370283 -1.253425
H  -3.85477 1.755107 -1.995355
H  3.14396 2.709664 0.213633
H  -1.440033 -1.925379 -2.776091
H  -2.222951 -2.782619 2.090064
H  -2.337942 -4.145926 -2.037831
H  -2.684428 -4.593872 0.41859
H  3.299641 -2.352408 2.069049
H  4.776043 -1.336765 1.823272
H  4.784122 -3.086362 1.345887
H  6.847729 0.501791 0.125162
H  5.82501 0.947173 -1.296354
H  5.758247 -0.734478 -0.632669
