program: Gaussian 09
title: 000053216
version: EM64L-G09RevD.01
frameworkgroup: C1[X(C16H25N3O5)]
method: RPBEPBE
basis: SDD
operation: Freq
keyword: #p
keyword: freq=noraman
keyword: PBEPBE/SDD
title: #p freq=noraman PBEPBE/SDD
converged: YES YES NO NO
title: Mulliken charges:
elementType: O O O O O N N N C C C C C C C C C C C C C C C C H H H H H H H H H H H H H H H H H H H H H H H H H
charge: -0.290715 -0.240253 -0.292064 -0.256840 -0.265400 -0.375918 -0.684570 -0.146332 -0.337754 -0.394886 -0.408181 -0.316406 0.292456 0.162273 -0.472018 -0.538283 0.253109 0.296056 0.056764 0.276142 -0.537460 -0.562056 -0.516932 -0.714245 0.186447 0.249643 0.203599 0.211710 0.245989 0.194829 0.214916 0.240966 0.280372 0.283790 0.282270 0.304013 0.333770 0.244485 0.222496 0.223994 0.233183 0.278303 0.221278 0.214379 0.258359 0.230707 0.223191 0.198957 0.231868
chargesum: 0.00000
title: Mulliken charges with hydrogens summed into heavy atoms:
elementType: O O O O O N N N C C C C C C C C C C C C C C C C
charge: -0.290715 -0.240253 -0.292064 -0.256840 -0.265400 -0.095547 -0.046787 -0.146332 0.098336 0.020423 0.032636 0.139475 0.292456 0.162273 -0.188229 -0.256014 0.253109 0.296056 0.056764 0.276142 0.153516 0.170708 0.186513 -0.060229
polarizability: 2.58155323e+02 3.79211078e+01 2.35661894e+02 -2.91350561e+01 2.67932061e+01 1.80381291e+02
1716.lowfreq: -8.6608 -3.9733 -0.0008 -0.0006 -0.0006 5.7079 9.0822 10.5918 28.6605
frequency: -6.6759 8.5773 28.3745 31.1459 41.6982 43.6907 67.7765 73.5978 90.5132 104.3134 109.3939 117.5704 142.5809 148.6716 159.2543 170.8696 179.4283 185.8888 204.6818 214.1243 222.8426 253.9275 260.2116 268.4163 274.1168 285.2103 304.8038 311.5389 332.8151 343.3509 354.3516 376.5609 390.7431 414.7614 429.2416 439.3834 461.2253 497.0380 502.8640 524.8941 549.4658 570.1304 581.4001 616.7281 648.9333 661.6087 685.7674 725.2181 731.9870 748.8667 770.8638 796.7008 831.9367 842.3236 861.7569 869.9546 885.1155 897.9679 927.3337 953.1641 975.2351 986.3406 1000.9579 1044.2952 1063.5260 1076.7464 1083.5623 1089.1891 1096.6672 1102.9126 1107.8899 1111.5024 1119.8663 1144.8412 1147.4871 1154.3862 1155.7082 1161.0676 1173.7884 1194.0457 1217.9993 1227.2341 1236.8674 1278.2176 1281.6560 1311.0183 1314.9413 1327.1299 1354.2049 1357.2988 1372.0229 1393.1536 1412.5797 1416.1974 1421.3284 1442.1168 1444.7293 1448.7760 1454.2304 1455.3188 1457.8221 1466.5824 1469.0389 1471.0160 1471.7486 1472.5554 1477.6897 1479.1891 1486.5528 1497.3312 1498.7653 1584.8843 1593.9264 1614.0139 1616.8523 1646.4309 2893.4739 2959.0424 2960.6858 2966.7483 2968.2939 2975.9334 2980.0718 2982.8372 3017.5527 3030.6611 3044.4081 3048.7758 3060.7301 3068.3702 3077.1069 3086.9212 3098.2204 3124.0594 3125.5244 3128.7327 3172.0729 3197.8937 3547.0831 3552.5309 3700.2110
redmass: 5.6738 4.2259 3.5235 1.8899 5.5990 3.5219 5.4997 4.2148 3.1880 3.7034 3.9726 3.1517 1.9325 2.2282 1.7477 2.7077 2.0842 3.2748 2.5000 2.5580 3.8817 2.6656 2.2176 2.9632 1.7080 4.6551 1.4165 2.4064 4.2476 2.8689 4.1960 1.2414 2.4360 6.1682 1.1128 2.6654 1.9896 4.1257 3.3517 6.4808 2.6030 4.5487 4.7829 3.0582 4.2036 7.1433 5.8315 3.6918 5.6129 1.6897 4.1077 2.9623 3.1615 2.7457 1.4325 6.4756 1.7882 2.5280 3.4740 8.9881 2.0525 4.2326 2.9900 1.9080 1.9962 1.3319 6.6879 2.7701 2.3843 2.1664 1.2440 1.2608 1.2534 2.1326 1.4894 2.3404 1.5267 1.5121 2.9231 1.4857 2.0172 1.3241 1.5838 1.2279 1.1889 3.6499 1.7068 1.4761 1.4121 1.4231 1.3714 4.3573 2.5387 1.1923 1.3495 1.1061 1.2486 1.3293 1.1472 1.0808 1.1122 1.0500 1.0871 1.2148 1.0682 1.0771 1.1270 1.0803 1.6413 1.1274 1.9530 8.6634 6.1241 1.2698 9.6998 3.9467 1.0394 1.0969 1.0333 1.0323 1.0600 1.0665 1.0329 1.0668 1.0792 1.0750 1.0929 1.1038 1.1051 1.0950 1.0981 1.0995 1.1085 1.1010 1.0996 1.1044 1.0910 1.0911 1.0719 1.0493 1.1031
irintensity: 0.0528 2.3082 2.2962 4.2976 5.0086 0.5792 1.1252 7.7174 7.4680 1.4043 9.1939 1.4756 2.7380 1.2212 4.1668 9.9706 6.5792 12.0264 2.2049 2.1797 1.4408 6.9286 4.3947 0.8915 2.8869 6.5591 0.3908 28.6879 10.1682 4.6942 1.4760 134.8799 29.6710 5.6572 166.3053 35.1998 100.2963 6.3471 11.0155 3.8350 2.6468 9.8846 1.3736 7.6535 13.9964 15.4710 16.4670 14.9585 25.4081 16.0467 7.9107 6.9426 8.6666 2.1383 1.0926 1.6381 43.8220 10.5726 79.8495 46.4137 17.3505 7.5778 35.2139 16.4504 1.0092 2.9760 401.5581 26.8371 18.1980 19.4244 20.4480 0.0736 0.1216 18.0527 28.5900 16.8518 94.5879 59.3325 223.4164 4.4697 1.3962 44.1124 58.3882 15.7225 2.3553 206.1008 98.7830 101.8927 23.5847 30.4943 3.9251 30.5308 85.3028 20.4258 28.6283 17.0399 13.2432 48.6169 21.4951 5.1374 42.8609 12.9898 15.3987 43.7306 28.1717 5.1612 61.9700 20.6465 54.8900 8.6081 194.4901 210.3212 10.5343 105.0038 138.7718 329.8104 107.8695 89.2023 58.6300 39.3757 22.9840 43.0661 100.3291 70.8221 4.1295 83.4511 39.0380 45.8749 18.0142 37.5182 20.4594 33.3719 14.5641 22.4810 23.9743 18.8351 2.7256 1.5171 7.5180 19.7663 18.6259
temp: 298.150 k
press: 1.00000 atm
elementType: 8 8 8 8 8 7 7 7 6 6 6 6 6 6 6 6 6 6 6 6 6 6 6 6 1 1 1 1 1 1 1 1 1 1 1 1 1 1 1 1 1 1 1 1 1 1 1 1 1
symmnumber: 1
zpe: 1051260.6 jmol-1
zpe.correction: 0.400404 hartree
zpe.thermalcorrener: 0.426850 hartree
zpe.thermalcorrenthalpy: 0.427794 hartree
zpe.thermalcorrgfe: 0.341855 hartree
zpe.sumelectzpe: -1163.159960 hartree
zpe.sumelectthermal: -1163.133514 hartree
zpe.sumelectthermalent: -1163.132570 hartree
zpe.sumelectthermalfe: -1163.218510 hartree
dipole: 1.6529 -0.5855 0.7124
dipole: 1.8927
quadrupole: -132.6870 -142.8192 -125.6990
quadrupole: 2.5030 5.0815 3.0921
quadrupole: 1.0481 -9.0841 8.0361 2.5030 5.0815 3.0921
hfenergy: -1163.5603644 hartree
pointgroup: C01 [X(C16H25N3O5)]
dipole: 0.6936857 0.1432611 -0.2296976 debye
polarizability: 243.3877772|-39.2725359|246.4253953|39.5453438|16.6465434|184.3853356 unknown
InChI: InChI=1S/C16H25N3O5/c1-18-16(17)19-7-5-6-8-24-15(20)11-9-12(21-2)14(23-4)13(10-11)22-3/h9-10,19H,5-8,17H2,1-4H3
charge 0 multiplicity 1
49 atoms
O  0.933524 -2.15651 1.623767
O  -4.027026 -0.63935 -1.63573
O  -1.489095 2.256049 1.220103
O  -3.633667 1.766052 -0.557943
O  0.093236 -3.523515 -0.079889
N  3.944956 0.049024 -1.000463
N  2.772078 1.313226 -2.58128
N  2.800867 1.984321 -0.246859
C  3.636896 -0.948477 1.312033
C  3.272608 -2.387077 0.880245
C  4.55906 -0.208955 0.310552
C  2.151309 -3.006338 1.731489
C  -0.938301 -1.355786 0.374425
C  0.038657 -2.455652 0.58404
C  -0.759515 -0.100448 0.997927
C  -2.012964 -1.572649 -0.520676
C  -2.921921 -0.526017 -0.784853
C  -1.646678 0.956682 0.709993
C  -2.75335 0.756614 -0.171111
C  3.133141 1.169835 -1.228444
C  -4.217528 -1.928774 -2.305483
C  -0.326423 2.494011 2.090934
C  -4.303382 2.552717 0.500683
C  2.156592 3.265715 -0.597552
H  4.13923 -0.974971 2.301162
H  2.719242 -0.345435 1.428059
H  4.163243 -3.046436 0.945187
H  2.940583 -2.400384 -0.177139
H  4.828412 0.773206 0.734966
H  5.491352 -0.786926 0.147244
H  2.396383 -2.994788 2.806911
H  1.904663 -4.031048 1.402135
H  3.800227 -0.749859 -1.619876
H  0.094857 0.036795 1.661737
H  -2.106464 -2.55663 -0.987311
H  3.337088 0.908172 -3.323951
H  2.017973 1.944072 -2.834794
H  -5.1214 -1.798348 -2.91834
H  -4.374973 -2.745535 -1.574189
H  -3.356111 -2.176928 -2.955451
H  -0.363896 3.568798 2.322851
H  0.619966 2.249988 1.573565
H  -0.405807 1.905744 3.02522
H  -4.886371 1.882836 1.160931
H  -3.570524 3.125747 1.091182
H  -4.983258 3.225676 -0.043131
H  1.060432 3.159313 -0.760083
H  2.57982 3.750629 -1.508042
H  2.289258 3.970212 0.24285
