program: Gaussian 09
title: 000006795
version: EM64L-G09RevD.01
frameworkgroup: C1[X(C12H12N2)]
method: RPBEPBE
basis: SDD
operation: Freq
keyword: #p
keyword: freq=noraman
keyword: PBEPBE/SDD
title: #p freq=noraman PBEPBE/SDD
converged: YES YES NO NO
title: Mulliken charges:
elementType: N N C C C C C C C C C C C C H H H H H H H H H H H H
charge: -0.157509 -0.157513 -0.404638 -0.404608 0.363557 0.363529 -0.140182 -0.140178 -0.254003 -0.253996 -0.123539 -0.123539 -0.128094 -0.128094 0.318838 0.305468 0.318843 0.305469 0.304157 0.304159 0.286325 0.286325 0.311853 0.311853 0.317759 0.317759
chargesum: 2.00000
title: Mulliken charges with hydrogens summed into heavy atoms:
elementType: N N C C C C C C C C C C C C
charge: -0.157509 -0.157513 0.219668 0.219703 0.363557 0.363529 0.163975 0.163981 0.032322 0.032329 0.188314 0.188314 0.189665 0.189666
polarizability: 2.07967467e+02 -4.67634408e-04 1.37545455e+02 1.30396262e+00 -1.52275960e-03 6.00265987e+01
1716.lowfreq: -10.1249 -7.8550 0.0005 0.0007 0.0008 8.8943 83.3144 101.2402 177.5284
frequency: 83.3117 101.2396 177.5281 196.9732 267.1343 307.8363 386.6258 389.4001 440.1660 450.0061 462.6471 490.7876 534.8655 545.8856 599.6321 640.1979 715.9500 717.5192 746.8276 759.2408 788.0687 789.4115 798.1256 905.2257 907.1119 930.0466 981.3931 983.2949 1000.4758 1018.6386 1025.2517 1027.4012 1063.3792 1063.4520 1081.0341 1100.8640 1144.1374 1158.6389 1180.7979 1196.7813 1202.5071 1232.6050 1244.3564 1295.5007 1318.1329 1320.1029 1342.2859 1354.7330 1380.0757 1398.9292 1424.4155 1446.4545 1459.2964 1461.5874 1487.2335 1515.8974 1566.7930 1569.7071 1595.5295 1610.0807 3030.6342 3037.1474 3117.6287 3122.1453 3179.8277 3180.6732 3187.3484 3187.8740 3194.3216 3198.6312 3204.1263 3205.0295
redmass: 4.1385 3.6806 3.4337 3.1013 4.1955 2.4802 5.4855 3.2256 3.1522 3.0670 4.1108 4.5094 3.7125 3.7514 2.7718 6.6969 5.5720 4.0944 2.9726 3.1198 4.5159 1.2496 1.4775 1.3108 1.4020 2.0555 1.3869 1.3757 2.4036 6.2163 1.4020 1.3853 2.3118 2.3995 2.2244 2.5050 1.9178 2.3108 3.2893 1.0769 1.1075 1.2450 1.2533 2.1131 1.9847 1.4783 2.6015 1.6884 1.5991 2.2933 1.7143 1.7142 1.1244 1.5195 1.6923 2.4450 6.2566 6.1209 4.9953 5.8080 1.0676 1.0619 1.1020 1.1058 1.0922 1.0923 1.0938 1.0943 1.0976 1.0958 1.1028 1.1021
irintensity: 1.3427 0.0167 0.0409 8.8539 0.1378 0.7449 0.2927 2.6988 0.1220 1.4560 14.4179 1.2558 0.3950 0.1702 4.8024 0.4128 0.2571 15.6590 0.1182 6.3075 0.1967 148.1082 6.0748 0.1163 0.1398 2.3492 0.0000 1.1031 0.2520 7.1475 0.0109 0.5806 0.8270 0.6025 0.0656 0.0109 18.3062 17.6030 46.1332 3.0662 0.1167 6.1696 15.5708 5.1908 5.9734 1.0539 17.8114 1.7429 35.8602 0.0877 23.2408 20.0131 6.0952 41.5889 126.2725 9.8802 11.6585 16.6398 79.9090 4.8903 1.0920 0.1164 0.9200 0.9662 0.0185 0.4355 0.8186 11.6315 1.9895 13.2044 44.8829 1.5313
temp: 298.150 k
press: 1.00000 atm
elementType: 7 7 6 6 6 6 6 6 6 6 6 6 6 6 1 1 1 1 1 1 1 1 1 1 1 1
symmnumber: 1
zpe: 569595.4 jmol-1
zpe.correction: 0.216947 hartree
zpe.thermalcorrener: 0.227024 hartree
zpe.thermalcorrenthalpy: 0.227968 hartree
zpe.thermalcorrgfe: 0.181374 hartree
zpe.sumelectzpe: -572.411981 hartree
zpe.sumelectthermal: -572.401904 hartree
zpe.sumelectthermalent: -572.400960 hartree
zpe.sumelectthermalfe: -572.447554 hartree
dipole: 0.0000 1.4264 -0.0001
dipole: 1.4264
quadrupole: -1.1023 -37.9962 -77.5174
quadrupole: -0.0002 -0.1436 -0.0002
quadrupole: 37.7697 0.8757 -38.6454 -0.0002 -0.1436 -0.0002
hfenergy: -572.6289283 hartree
pointgroup: C01 [X(C12H12N2)]
dipole: 0.0000121 0.5612038 0.000041 debye
dipolederiv: -0.0816131 0.2107094 -0.0057984 0.2342172 -0.3130304 0.0377261 0.0473534 0.0164401 -0.0538833 -0.0816483 -0.2107169 -0.0058101 -0.2342421 -0.3129882 -0.0377221 0.0472974 -0.0164526 -0.0538938 0.1981765 -0.2091186 0.0305581 -0.1126919 0.302445 -0.0584215 -0.0187923 -0.0081582 0.1640084 0.1982057 0.2091427 0.0305518 0.1127004 0.3024011 0.058402 -0.0187885 0.0081462 0.1640073 0.3278584 0.0820764 -0.0026163 -0.2533385 0.1596428 -0.0363249 0.0398581 -0.0023019 0.079533 0.3278724 -0.0821036 -0.0025818 0.2533231 0.1596325 0.0363188 0.0399881 0.0023213 0.0795362 -0.2321253 -0.230616 0.0406428 0.3381457 0.2611595 -0.0516639 -0.0798426 -0.049353 0.0426926 -0.2321445 0.2306502 0.040653 -0.3380981 0.261155 0.0516996 -0.0798332 0.0493594 0.0426991 -0.4783034 0.1410848 -0.0443574 0.2244081 0.0363896 -0.0302707 -0.0676524 -0.0174576 -0.0367243 -0.4783271 -0.1410377 -0.0443661 -0.2243658 0.0364072 0.0302989 -0.0676489 0.0174852 -0.0367105 0.2322657 0.0620981 -0.0057313 -0.3879556 -0.3300342 0.0619711 0.0703919 0.0576299 -0.0420659 0.2322962 -0.0621433 -0.0057785 0.3879048 -0.3300465 -0.0620002 0.0703491 -0.0576573 -0.0420779 0.4053431 -0.11477 0.0245982 -0.0391692 0.2535178 -0.047657 0.035364 -0.0515245 0.0227789 0.4053548 0.1147606 0.0246063 0.0391637 0.2534929 0.0476695 0.035354 0.051542 0.0227886 0.0695519 0.0672345 -0.0241945 0.0521587 0.0756272 -0.0526889 -0.0034148 -0.0367636 0.0359946 0.025774 -0.0668242 -0.020331 0.0130336 0.1097624 -0.0124978 -0.0168993 -0.0194787 0.1321522 0.0695405 -0.0672378 -0.0241744 -0.0521553 0.075652 0.0526736 -0.0034035 0.0367593 0.0359898 0.0257782 0.0668207 -0.0203395 -0.0130296 0.1097619 0.0125025 -0.0168964 0.0194766 0.132142 0.1582708 0.0468905 -0.0073174 0.0282101 0.0854859 0.012374 -0.0132342 0.009527 0.1674512 0.1582624 -0.0468947 -0.0073187 -0.0282197 0.0854936 -0.0123749 -0.0132219 -0.0095215 0.1674516 0.0826361 -0.0586729 0.0118472 -0.0638448 0.1155405 0.0081255 0.0105425 0.0006576 0.1551301 0.0826441 0.0586731 0.0118602 0.0638509 0.1155294 -0.0081299 0.0105359 -0.0006661 0.1551283 0.1588313 -0.0121091 0.0022078 -0.0152166 0.1259028 0.0084154 0.0000801 0.0081682 0.1732781 0.1588321 0.0121054 0.0022138 0.015214 0.1259028 -0.0084211 0.0000804 -0.0081779 0.1732749 0.1333328 -0.0017322 0.000487 -0.0066325 0.1175972 0.0098959 -0.0037895 0.0108433 0.1596602 0.1333349 0.0017309 0.0004892 0.0066296 0.1176002 -0.0099 -0.0037776 -0.0108433 0.1596585 unknown
polarizability: 207.9775573|-0.0022675|137.5454554|0.4553898|0.002815|60.016508 unknown
InChI: InChI=1S/C12H12N2/c1-3-7-13-9-10-14-8-4-2-6-12(14)11(13)5-1/h1-8H,9-10H2
charge 2 multiplicity 1
26 atoms
N  1.422621 0.806804 -0.204294
N  -1.422531 0.806916 0.204491
C  0.610741 2.047482 -0.460086
C  -0.610568 2.047569 0.460181
C  0.742944 -0.388546 0.015217
C  -0.742971 -0.388477 -0.015173
C  2.795501 0.866324 -0.222043
C  -2.795406 0.866528 0.222417
C  1.495955 -1.556763 0.253471
C  -1.4961 -1.556605 -0.253474
C  3.566298 -0.287347 -0.008462
C  -3.566315 -0.28707 0.00884
C  2.909327 -1.514234 0.238544
C  -2.909467 -1.513977 -0.238396
H  0.321781 2.062769 -1.526617
H  1.234038 2.930814 -0.251534
H  -0.321645 2.062965 1.526718
H  -1.233807 2.930913 0.251497
H  3.244435 1.845472 -0.408401
H  -3.244258 1.845692 0.408889
H  0.988016 -2.497854 0.475206
H  -0.988252 -2.497712 -0.475351
H  4.6565 -0.212838 -0.026005
H  -4.656509 -0.21249 0.026576
H  3.486197 -2.42478 0.425283
H  -3.486425 -2.424455 -0.425191
