program: Gaussian 09
title: 000053122
version: EM64L-G09RevD.01
frameworkgroup: C1[X(C12H17N3O3)]
method: RPBEPBE
basis: SDD
operation: Freq
keyword: #p
keyword: freq=noraman
keyword: PBEPBE/SDD
title: #p freq=noraman PBEPBE/SDD
converged: YES YES NO NO
title: Mulliken charges:
elementType: O O O N N N C C C C C C C C C C C C H H H H H H H H H H H H H H H H H
charge: -0.208758 -0.219085 -0.213582 -0.086490 -0.453384 0.020466 -0.490288 -0.305429 -0.313424 0.189764 -0.680749 -0.678134 0.508330 -0.424428 -0.313782 0.391817 -0.344949 -0.363797 0.189923 0.252213 0.178237 0.210889 0.182604 0.222746 0.241315 0.201304 0.214893 0.247724 0.203127 0.210121 0.307573 0.231737 0.316609 0.287569 0.287319
chargesum: 0.00000
title: Mulliken charges with hydrogens summed into heavy atoms:
elementType: O O O N N N C C C C C C C C C C C C
charge: -0.208758 -0.219085 -0.213582 -0.086490 -0.145811 0.020466 -0.048152 0.083697 0.091926 0.189764 -0.023237 -0.017162 0.508330 -0.192691 0.002826 0.391817 -0.057379 -0.076477
polarizability: 2.96352813e+02 -4.41243702e+00 1.48805557e+02 3.24836241e+00 2.29777073e+01 1.12298180e+02
1716.lowfreq: -7.0929 -1.8713 -0.0005 -0.0001 0.0002 2.4004 14.1673 26.2697 38.6871
frequency: 13.9561 25.9866 37.8364 55.3297 56.4225 65.3718 79.9084 95.1168 141.5878 156.7890 173.6562 196.7340 219.4621 254.4498 278.8966 290.2558 309.9898 346.7060 357.0509 395.1877 416.7345 436.0248 480.6671 501.2496 509.0744 575.1538 621.1035 630.9535 666.9901 668.0555 723.9877 738.7903 750.3929 775.3164 794.5582 799.2786 836.8795 838.1639 880.8214 907.7755 925.1682 979.3835 987.4849 998.9493 1009.3223 1012.2520 1073.5736 1084.8185 1090.6986 1096.5118 1112.5411 1118.6350 1135.6211 1163.1017 1179.8870 1219.2879 1225.6900 1260.1165 1269.9787 1284.0055 1294.6958 1298.8206 1349.1593 1357.7036 1369.4954 1375.5125 1387.1193 1389.7373 1390.9927 1427.9411 1442.3525 1465.5676 1467.3260 1470.3608 1478.4516 1485.0026 1486.0355 1492.0668 1504.7348 1596.2167 1613.6056 1647.4995 2760.0606 2841.8748 2858.6867 2984.8731 2988.4634 3009.7727 3038.4389 3046.7510 3075.0696 3079.2190 3098.1991 3103.1791 3126.6203 3178.5913 3185.6937 3203.0491 3498.7080
redmass: 4.5654 4.2456 2.7819 1.9180 9.3847 3.3764 4.6770 4.3365 3.7834 2.4426 3.1345 2.1799 1.7815 2.7454 1.9333 2.8070 5.1093 5.5229 3.2973 4.8305 3.0091 3.1541 3.0935 3.0442 7.2442 3.5284 6.8934 7.1615 1.3775 3.0255 4.7754 4.5584 3.3927 4.0433 1.1876 1.3865 1.3865 4.2658 1.5093 2.2537 4.1255 1.3425 2.0939 3.0800 2.1436 1.3198 2.0285 2.5923 1.9736 2.8940 1.8421 1.3064 2.6058 1.8517 1.4233 2.3220 4.2853 1.4292 1.7432 1.2562 1.2954 1.4428 2.7587 2.0323 1.3782 1.4112 2.7919 1.4196 1.2929 5.0293 1.0975 1.0544 1.0703 1.0558 1.0549 1.0623 2.3025 1.0769 2.3625 6.7030 5.8289 5.8392 1.0710 1.0726 1.0715 1.0366 1.0362 1.0817 1.0878 1.0876 1.0972 1.0975 1.1003 1.1004 1.0908 1.0907 1.0945 1.0959 1.0758
irintensity: 0.3050 0.5298 0.2638 0.4546 4.2089 1.2390 1.1557 1.7064 1.8207 4.6966 0.0214 0.4346 0.4259 4.3832 4.6113 0.2011 1.1830 0.0891 6.2839 6.7539 0.0319 4.4029 1.3240 21.4977 1.4288 5.0698 0.8965 2.5309 17.4081 60.7727 19.4030 4.1171 9.7495 23.1341 4.4781 4.9809 29.7606 4.0574 68.7542 4.9179 11.4816 1.0687 9.0567 0.2484 7.5180 0.1020 8.6694 38.5839 69.5102 29.5669 27.1369 25.7865 268.4884 45.1035 148.6645 100.9321 400.6467 23.9242 32.8555 44.8167 16.7038 56.6610 59.5466 50.1615 3.3679 9.4756 223.3492 17.2730 55.2264 31.4788 4.7124 5.2343 2.4151 9.7427 2.6651 12.3002 0.2462 12.8594 499.0967 62.5656 205.8779 80.9354 144.9152 74.1802 176.7765 27.1822 32.9640 19.3044 12.9098 6.3347 56.7064 82.0835 26.2348 33.5609 12.6068 2.1118 2.7938 4.7787 22.0619
temp: 298.150 k
press: 1.00000 atm
elementType: 8 8 8 7 7 7 6 6 6 6 6 6 6 6 6 6 6 6 1 1 1 1 1 1 1 1 1 1 1 1 1 1 1 1 1
symmnumber: 1
zpe: 736883.7 jmol-1
zpe.correction: 0.280664 hartree
zpe.thermalcorrener: 0.299328 hartree
zpe.thermalcorrenthalpy: 0.300272 hartree
zpe.thermalcorrgfe: 0.230422 hartree
zpe.sumelectzpe: -855.954099 hartree
zpe.sumelectthermal: -855.935436 hartree
zpe.sumelectthermalent: -855.934492 hartree
zpe.sumelectthermalfe: -856.004341 hartree
dipole: 7.1660 -4.1036 -2.6563
dipole: 8.6745
quadrupole: -142.4044 -102.5780 -107.3279
quadrupole: -0.4528 -1.8120 0.5657
quadrupole: -24.9676 14.8588 10.1088 -0.4528 -1.8120 0.5657
hfenergy: -856.2347636 hartree
pointgroup: C01 [X(C12H17N3O3)]
dipole: 2.7990752 -1.5286934 -1.214742 debye
polarizability: 296.4106534|-1.588013|146.6653641|-3.8198087|24.5745986|114.3805331 unknown
InChI: InChI=1S/C12H17N3O3/c1-3-14(4-2)9-12(16)13-10-5-7-11(8-6-10)15(17)18/h5-8,13H,3-4,9H2,1-2H3
charge 0 multiplicity 1
35 atoms
O  1.478369 0.959444 0.769918
O  -5.975836 -0.647807 -0.246217
O  -5.52718 1.198338 1.020248
N  4.036521 0.044443 -0.224798
N  0.417584 -0.784446 -0.393968
N  -5.154266 0.179752 0.316058
C  2.864181 -0.822215 -0.274294
C  5.315705 -0.702517 -0.117912
C  4.036131 1.104927 -1.268162
C  1.547582 -0.097785 0.092265
C  5.518658 -1.375973 1.25332
C  4.880904 2.330825 -0.874887
C  -0.951542 -0.499177 -0.186945
C  -1.90244 -1.37817 -0.784474
C  -1.404486 0.61246 0.58162
C  -3.708215 -0.054228 0.142684
C  -3.277822 -1.161337 -0.624144
C  -2.783363 0.828776 0.743426
H  2.724974 -1.329237 -1.272252
H  2.992083 -1.635638 0.466517
H  5.417155 -1.464769 -0.933992
H  6.131282 0.02551 -0.270084
H  4.378105 0.702489 -2.256152
H  2.992036 1.44102 -1.399827
H  5.428136 -0.627177 2.058571
H  4.783004 -2.17836 1.447212
H  6.522889 -1.835398 1.306087
H  4.518165 2.737093 0.084118
H  5.953232 2.087288 -0.766271
H  4.796384 3.115445 -1.649363
H  0.616559 -1.604762 -0.974723
H  -1.557014 -2.235206 -1.375708
H  -0.67275 1.283572 1.032991
H  -4.021011 -1.824067 -1.074312
H  -3.155312 1.673986 1.328549
