program: Gaussian 09
title: 000053114
version: EM64L-G09RevD.01
frameworkgroup: C1[X(C6H13O4PS2)]
method: RPBEPBE
basis: SDD
operation: Freq
keyword: #p
keyword: freq=noraman
keyword: PBEPBE/SDD
title: #p freq=noraman PBEPBE/SDD
converged: YES YES NO NO
title: Mulliken charges:
elementType: S S P O O O O C C C C C C H H H H H H H H H H H H H
charge: -0.009919 0.278214 0.958091 -0.493932 -0.624949 -0.267357 -0.222632 -0.874116 -0.889126 -0.727909 -0.475283 0.308457 -0.499873 0.277890 0.290518 0.270243 0.348165 0.311007 0.276025 0.319355 0.245761 0.244226 0.232497 0.244722 0.245533 0.234390
chargesum: 0.00000
title: Mulliken charges with hydrogens summed into heavy atoms:
elementType: S S P O O O O C C C C C C
charge: -0.009919 0.278214 0.958091 -0.493932 -0.624949 -0.267357 -0.222632 -0.035464 -0.229954 -0.132528 0.247201 0.308457 0.224772
polarizability: 1.75620701e+02 6.01151125e+00 1.47373226e+02 -5.11654260e-01 -9.69508096e-03 1.01504502e+02
1716.lowfreq: -7.8498 -6.3064 0.0006 0.0022 0.0023 5.8793 13.0465 19.7461 25.6988
frequency: 9.4815 19.5964 25.6703 52.3074 64.2907 73.2585 81.7963 98.0996 100.8393 139.4144 142.7703 154.7061 167.9375 179.2536 219.0704 233.4543 244.4792 270.0837 301.1161 315.6983 362.8205 391.4212 402.6739 548.9580 580.2282 613.1631 648.9414 663.7334 717.1259 733.7017 818.5715 856.0102 900.2291 931.1019 951.7112 968.1079 983.7591 1023.2907 1113.2204 1115.0522 1121.0103 1132.2318 1147.8111 1149.8177 1179.9207 1267.5798 1289.9747 1344.3168 1396.2618 1423.0723 1423.5309 1424.8250 1429.7932 1434.0392 1453.5521 1458.3980 1464.0773 1471.3984 1655.6457 2979.8586 3006.3144 3011.0045 3014.4963 3024.8464 3080.2172 3080.8390 3109.2975 3129.9164 3131.8627 3147.1008 3151.8474 3154.1507
redmass: 5.0950 5.7257 5.2988 6.1901 2.8733 1.1181 3.6822 1.1334 4.9596 3.9962 1.1511 3.4187 3.1761 3.5835 3.9769 6.6506 4.1834 5.3616 12.8627 4.3963 6.0473 5.5209 8.9731 2.9063 8.3873 7.3198 5.2661 7.5663 6.7397 4.9840 2.6949 2.4221 1.7294 1.8615 1.4644 5.6813 5.5418 3.6451 1.2732 1.2536 2.1588 1.3148 1.3468 1.3858 1.0812 1.1910 1.4510 1.1597 1.0679 1.1705 1.1196 1.0864 1.0515 1.0495 1.0497 1.0489 1.0506 1.0520 9.5028 1.0310 1.0298 1.0608 1.0573 1.0313 1.1045 1.1042 1.1048 1.1025 1.1045 1.1023 1.1049 1.1026
irintensity: 0.5536 1.0075 0.3000 1.2051 3.0687 0.3658 2.3975 0.5876 0.6156 14.8112 1.6183 6.3699 6.9149 7.4432 0.5586 4.8149 7.5570 14.4771 5.2186 3.0594 5.4435 54.4111 72.3633 2.5599 55.3285 108.9810 3.4171 42.9057 32.8824 12.1361 2.7531 12.9463 12.2820 17.2262 131.7494 31.8748 110.4496 84.6345 4.5353 0.1656 243.5743 1.5702 65.6144 10.6309 18.2331 14.5742 68.1316 20.8506 11.5480 14.7575 3.5493 35.1340 13.6663 31.8546 14.3407 16.8848 12.3961 19.2513 150.1075 43.9084 38.3349 8.0110 13.2205 0.4976 4.6449 25.4974 24.7412 14.3067 2.4521 0.7805 14.2349 0.8583
temp: 298.150 k
press: 1.00000 atm
elementType: 16 16 15 8 8 8 8 6 6 6 6 6 6 1 1 1 1 1 1 1 1 1 1 1 1 1
symmnumber: 1
zpe: 501870.2 jmol-1
zpe.correction: 0.191152 hartree
zpe.thermalcorrener: 0.209937 hartree
zpe.thermalcorrenthalpy: 0.210881 hartree
zpe.thermalcorrgfe: 0.139282 hartree
zpe.sumelectzpe: -1673.606569 hartree
zpe.sumelectthermal: -1673.587784 hartree
zpe.sumelectthermalent: -1673.586840 hartree
zpe.sumelectthermalfe: -1673.658440 hartree
dipole: -2.2614 -2.9810 0.7872
dipole: 3.8236
quadrupole: -90.1771 -96.8403 -104.3799
quadrupole: -16.3256 2.9847 -6.5862
quadrupole: 6.9554 0.2921 -7.2475 -16.3256 2.9847 -6.5862
hfenergy: -1673.7977212 hartree
pointgroup: C01 [X(C6H13O4P1S2)]
dipole: 1.0085522 1.0994587 -0.1922398 debye
dipolederiv: -0.7195749 -0.1540763 0.0386083 -0.466626 -0.4642261 0.0605292 0.1118935 0.1053724 -0.3992391 -0.2991668 -0.0757017 -0.0951169 0.0517994 -0.0617822 -0.0592556 -0.130985 -0.0844842 -0.0339334 1.983961 -0.0413407 -0.2384399 0.3489112 1.3023387 -0.1966087 -0.4511782 -0.3502367 1.2966352 -1.4037217 0.2896691 0.122273 0.2895849 -0.794493 0.0119486 0.0668162 0.0448853 -0.4911438 -0.7429622 0.0227306 0.0027674 -0.1180882 -0.5946749 0.0006786 0.065957 0.0782568 -0.7430676 -0.758531 0.2564139 -0.1998582 0.504113 -1.0775746 0.4624115 -0.3099063 0.4192439 -0.5407551 -0.8042042 -0.2799419 0.0627675 0.0906378 -0.667315 0.1959491 -0.1061708 0.1513828 -0.3821394 -0.2458169 -0.0644806 0.0374821 -0.0109912 -0.3186607 -0.0114497 0.0716559 0.040697 -0.18937 0.9223531 0.2791668 0.1366487 0.3337314 0.1937539 0.0664661 0.3964381 0.1846577 -0.0558563 -0.4933851 0.0527171 -0.0523426 -0.0946954 0.141686 -0.0393535 0.1292973 -0.0110617 0.1090077 0.4346901 -0.094452 -0.0371566 -0.5409999 0.4599054 0.0425638 -0.0893378 0.0096435 0.2637934 1.2711211 0.0324306 0.1377603 -0.3929285 1.3265511 -0.6008009 0.2689997 -0.5154481 0.5067713 0.4922907 -0.2243488 0.1439196 -0.1475256 0.3507563 -0.0590846 0.1101809 -0.0751301 0.3272703 0.1063597 -0.0147519 -0.0494138 0.0017736 0.0707405 -0.0219993 -0.0524087 -0.0360383 -0.0023922 0.0963196 -0.0221889 0.0511502 -0.0657633 0.017509 0.0678937 0.0589706 0.030745 0.0454519 -0.0365622 0.0353847 -0.0045233 0.0557245 0.0919826 -0.0017048 -0.0060754 0.0017202 0.1108381 -0.0487996 0.0063524 0.012161 -0.0402067 0.0979375 -0.0039937 -0.0618923 -0.0867843 0.0362626 -0.0381786 -0.0142284 -0.0409477 -0.0098355 -0.0368438 0.0348111 -0.0491803 0.0292574 0.0987677 0.1028074 -0.0596215 -0.0288114 -0.0068019 -0.0924923 0.0095431 -0.0727327 0.0066737 0.025245 0.1307531 0.0302844 0.0553265 0.0660949 0.0266953 0.0559603 0.0006693 0.0465994 -0.0050131 -0.1416545 0.0064462 -0.0197748 0.0074621 0.0625872 -0.0136602 -0.0173099 -0.0115763 0.1246563 0.0849307 -0.0074592 -0.0621333 0.0926886 0.0035632 -0.0615224 0.0173471 -0.0942586 -0.0785366 0.0966613 -0.061174 0.0802 0.0671546 -0.0443265 0.0596708 0.0420847 0.0984129 -0.029307 -0.0490769 0.0927874 0.0241082 0.0133016 0.0849522 0.0133272 0.0950936 -0.0238916 -0.0589128 -0.009269 0.0419453 -0.0852337 -0.0501663 -0.0018365 -0.1132479 -0.0705434 -0.0517236 -0.0067448 0.0686555 -0.0325627 0.0085794 0.021651 -0.0767334 0.1009281 -0.0176833 0.0930857 0.0717118 unknown
polarizability: 176.1740272|5.0091483|135.134847|4.3312604|-19.2245913|113.1895555 unknown
InChI: InChI=1S/C4H7O2S2.C2H6O2P/c1-6-4(5)2-8-3-7;1-4-5(2)3/h2-3H2,1H3;1-2H3
charge 0 multiplicity 1
26 atoms
S  1.3967 -1.015367 2.062945
S  -1.441339 -2.181857 1.166437
P  2.305034 -0.008166 0.175431
O  4.029029 -0.100829 0.373204
O  1.705364 -0.68583 -1.151196
O  -3.044293 0.94862 -0.837959
O  -3.994066 -1.005105 0.01191
C  2.108969 1.823743 0.373825
C  0.413747 -2.360667 1.124152
C  -1.541264 -0.632866 0.09982
C  4.681098 -1.422358 0.262964
C  -2.987101 -0.303521 -0.217643
C  -4.399725 1.39556 -1.247379
H  2.523647 2.128583 1.346011
H  2.654445 2.323776 -0.441669
H  1.039178 2.075309 0.322946
H  0.776264 -2.343826 0.081053
H  0.647375 -3.317889 1.611416
H  -1.079842 0.209342 0.64381
H  -0.971322 -0.790974 -0.832861
H  5.753522 -1.220316 0.399416
H  4.499359 -1.868031 -0.730933
H  4.319262 -2.100302 1.058703
H  -5.057223 1.473425 -0.365428
H  -4.836361 0.679296 -1.963338
H  -4.241058 2.377348 -1.714339
