program: Gaussian 09
title: 000053186
version: EM64L-G09RevD.01
frameworkgroup: C1[X(C18H19NO5)]
method: RPBEPBE
basis: SDD
operation: Freq
keyword: #p
keyword: freq=noraman
keyword: PBEPBE/SDD
title: #p freq=noraman PBEPBE/SDD
converged: YES YES NO NO
title: Mulliken charges:
elementType: O O O O O N C C C C C C C C C C C C C C C C C C H H H H H H H H H H H H H H H H H H H
charge: -0.310874 -0.263615 -0.268081 -0.222224 -0.248171 -0.446100 0.428762 0.165394 -0.005504 0.296761 -0.480609 0.147925 -0.372725 0.247178 -0.347853 -0.343389 -0.511911 0.340481 -0.392354 0.209993 -0.527805 -0.538278 -0.783984 -0.535171 0.344919 0.245385 0.238912 0.267467 0.263965 0.244966 0.338028 0.227664 0.229518 0.243639 0.217484 0.249392 0.228893 0.256282 0.255333 0.214717 0.223710 0.245255 0.226622
chargesum: 0.00000
title: Mulliken charges with hydrogens summed into heavy atoms:
elementType: O O O O O N C C C C C C C C C C C C C C C C C C
charge: -0.310874 -0.263615 -0.268081 -0.222224 -0.248171 -0.108072 0.428762 0.165394 -0.005504 0.296761 -0.135690 0.147925 -0.127340 0.247178 -0.108941 -0.075922 -0.247946 0.340481 -0.147388 0.209993 0.173017 0.157491 -0.057652 0.160417
polarizability: 3.70793008e+02 2.49817537e+00 2.22093325e+02 1.82494893e+01 6.76653921e+00 1.47435615e+02
1716.lowfreq: -8.2979 -4.9683 -0.0008 -0.0006 -0.0005 3.6840 18.9120 24.2959 39.1551
frequency: 18.8337 24.2566 39.0656 59.9085 65.7949 74.7655 83.7130 93.2868 96.2742 101.2561 122.2196 139.8314 146.8428 165.8870 191.3551 199.5460 211.5702 221.3768 235.4219 247.5475 269.2322 282.2144 293.2832 306.5401 335.8560 343.4240 364.0052 415.0066 449.3137 456.7262 469.3459 491.3303 526.4306 536.9113 563.3411 573.5824 592.4139 614.6601 623.9619 649.3905 652.9051 700.6995 709.4237 721.0590 747.4442 767.2897 770.2551 802.3317 815.5125 835.9005 845.1325 881.2778 932.8024 939.9082 950.6135 960.6137 976.5165 984.8530 993.8814 1007.5623 1018.6744 1040.4363 1102.2911 1109.6972 1111.9856 1116.5008 1124.7810 1142.0092 1147.5800 1156.2047 1160.0536 1178.1533 1202.2545 1219.8693 1244.0109 1255.9881 1264.8334 1277.4051 1295.9949 1375.8181 1387.0951 1391.7591 1412.4819 1426.6312 1433.6661 1438.9766 1446.8654 1450.6973 1465.7219 1465.8494 1467.0013 1467.7364 1468.6188 1469.7448 1472.9802 1481.7013 1490.8883 1518.4720 1532.9029 1570.7200 1596.5526 1608.8333 1616.3443 1625.1881 2962.2468 2965.2855 2969.1799 2994.7672 3051.5688 3055.6587 3061.0442 3096.6838 3098.0499 3127.3170 3128.2311 3128.6318 3147.1560 3150.1898 3168.0366 3175.0354 3178.9157 3192.1763 3515.5682
redmass: 5.8317 4.6893 4.4622 2.4906 1.7069 3.5878 3.3021 3.2738 4.2838 3.3262 4.5454 4.5342 4.5339 3.5780 3.3830 1.6831 1.5144 1.4103 5.6262 2.3404 1.6650 3.3579 5.2361 5.8388 4.0095 4.9276 6.1992 4.3182 4.5089 3.2677 3.9366 4.6970 5.5056 6.0804 4.4860 4.7714 4.2271 4.4337 4.4911 4.9301 4.9148 3.3436 3.2918 1.4486 3.0572 4.1637 3.2333 1.5073 2.1113 4.2672 1.7946 6.2053 5.6620 1.4034 1.4059 1.4871 2.3572 7.9009 8.4254 2.2576 2.7043 1.6338 2.7728 1.2604 1.2590 1.2580 1.9415 1.4963 1.4905 1.3745 1.5816 1.7786 2.0286 2.5361 2.7143 2.1483 2.6909 1.6851 2.1487 6.0494 1.2470 6.0487 2.6580 2.0769 1.2160 1.6548 1.5655 1.0454 1.0510 1.0502 1.4756 1.0714 1.1709 1.1200 1.0617 1.3933 2.1949 2.8226 7.4934 7.8876 7.5728 6.4672 6.4704 5.2835 1.0327 1.0326 1.0322 1.0359 1.1039 1.1042 1.1045 1.0991 1.0997 1.1000 1.1004 1.0997 1.0872 1.0885 1.0961 1.0945 1.0913 1.0926 1.0764
irintensity: 1.0730 1.1969 2.9406 5.9126 0.0421 1.8924 0.7219 8.1306 5.8399 2.5346 4.8071 4.4595 2.7586 1.8558 1.5535 1.2916 2.8375 0.8912 11.0899 1.5584 0.9151 3.5861 1.8729 3.0715 0.1580 0.0824 2.9804 2.3339 6.9196 6.0066 7.1294 3.2013 45.9242 18.7384 25.6912 5.2448 15.7364 3.4132 6.7526 1.5270 1.4380 7.3519 3.8477 73.5086 17.8556 8.4934 25.0471 15.7326 29.2677 32.5638 49.5566 27.1377 5.0191 0.2981 2.7132 22.6812 48.7246 20.9315 56.7207 9.8710 65.9044 14.7913 36.9096 0.0792 0.1366 0.5549 286.8867 24.1995 27.4864 10.4352 29.3178 77.7656 52.2913 69.9011 119.0257 320.3909 73.5474 12.1615 297.4989 49.2168 79.5205 14.9504 39.5957 229.9772 1.9493 106.1491 21.9372 14.1407 16.0402 13.0928 129.2108 29.0065 71.4515 32.5390 39.0687 27.8745 10.3296 196.8033 304.4190 126.4327 52.6726 159.4715 256.4082 123.8109 58.4502 79.0269 68.7098 15.5272 37.0285 45.2263 39.2693 13.0330 15.3927 26.4348 23.4984 15.7996 7.2192 1.1097 11.4468 12.3193 3.2782 11.6306 44.7448
temp: 298.150 k
press: 1.00000 atm
elementType: 8 8 8 8 8 7 6 6 6 6 6 6 6 6 6 6 6 6 6 6 6 6 6 6 1 1 1 1 1 1 1 1 1 1 1 1 1 1 1 1 1 1 1
symmnumber: 1
zpe: 879909.7 jmol-1
zpe.correction: 0.335140 hartree
zpe.thermalcorrener: 0.359249 hartree
zpe.thermalcorrenthalpy: 0.360193 hartree
zpe.thermalcorrgfe: 0.279690 hartree
zpe.sumelectzpe: -1126.414103 hartree
zpe.sumelectthermal: -1126.389994 hartree
zpe.sumelectthermalent: -1126.389050 hartree
zpe.sumelectthermalfe: -1126.469553 hartree
dipole: -0.8224 8.3509 -0.5156
dipole: 8.4071
quadrupole: -89.9124 -141.9788 -133.4714
quadrupole: 18.9612 2.8325 2.5625
quadrupole: 31.8751 -20.1913 -11.6839 18.9612 2.8325 2.5625
hfenergy: -1126.7492431 hartree
pointgroup: C01 [X(C18H19N1O5)]
dipole: -0.3275076 3.259587 -0.4563056 debye
polarizability: 365.8003315|5.4856796|222.7894433|37.2911765|2.3645048|151.7321724 unknown
InChI: InChI=1S/C18H19NO5/c1-11(20)19-15-9-12(5-8-16(15)23-3)18(21)14-7-6-13(22-2)10-17(14)24-4/h5-10,19H,1-4H3
charge 0 multiplicity 1
43 atoms
O  4.092762 2.055394 -0.477241
O  -1.527124 0.7216 1.309326
O  -5.996381 0.317521 -0.498443
O  -0.283189 -2.604953 -0.576259
O  4.023913 -2.622898 1.094776
N  4.356338 -0.409763 0.386711
C  0.655594 -0.398308 -0.424697
C  -1.918021 -0.858529 -0.464093
C  -0.496719 -1.355123 -0.464541
C  3.049299 -0.040366 -0.022691
C  1.922756 -0.887182 -0.006751
C  2.900579 1.305395 -0.491362
C  0.525933 0.936266 -0.877097
C  -2.432357 0.161557 0.400935
C  1.649252 1.788176 -0.922092
C  -2.835386 -1.518171 -1.316041
C  -3.795772 0.521629 0.358908
C  -4.671269 -0.134469 -0.540107
C  -4.198797 -1.170036 -1.383163
C  4.786543 -1.630173 0.907348
C  4.03836 3.439614 -0.951688
C  -2.032702 1.70326 2.271636
C  6.277204 -1.68486 1.24135
C  -6.967771 -0.342377 -1.376914
H  2.024874 -1.922245 0.325113
H  -0.448321 1.306296 -1.210378
H  1.54178 2.812423 -1.290425
H  -2.445993 -2.331675 -1.936991
H  -4.217964 1.28745 1.013869
H  -4.862875 -1.698369 -2.07179
H  5.048296 0.337434 0.280639
H  3.351888 4.044972 -0.329874
H  3.721268 3.482905 -2.010832
H  5.0650 3.821658 -0.853757
H  -2.427988 2.603822 1.762537
H  -1.159909 1.973579 2.883438
H  -2.820022 1.263592 2.913703
H  6.744971 -2.494726 0.655057
H  6.395467 -1.944208 2.307552
H  6.816164 -0.742599 1.040597
H  -6.696363 -0.215326 -2.442554
H  -7.92427 0.161056 -1.174298
H  -7.054247 -1.420144 -1.140416
