program: Gaussian 09
title: 000053038
version: EM64L-G09RevD.01
frameworkgroup: C1[X(C12H3Cl7)]
method: RPBEPBE
basis: SDD
operation: Freq
keyword: #pfreq=noraman
keyword: PBEPBE/SDD
title: #p freq=noraman PBEPBE/SDD
converged: NO NO NO NO
title: Mulliken charges:
elementType: Cl Cl Cl Cl Cl Cl Cl C C C C C C C C C C C C H H H
charge: 0.046020 0.046019 -0.019951 0.060534 0.060532 0.068874 -0.030066 0.582356 0.381254 -0.323104 -0.323043 -0.260881 -0.306683 -0.081998 -0.081962 -0.107918 -0.194031 -0.217239 -0.104182 0.256270 0.284891 0.264308
chargesum: 0.00000
title: Mulliken charges with hydrogens summed into heavy atoms:
elementType: Cl Cl Cl Cl Cl Cl Cl C C C C C C C C C C C C
charge: 0.046020 0.046019 -0.019951 0.060534 0.060532 0.068874 -0.030066 0.582356 0.381254 -0.323104 -0.323043 -0.260881 -0.050413 -0.081998 -0.081962 -0.107918 0.090860 0.047069 -0.104182
polarizability: 2.88123113e+02 -4.15510774e-03 1.84158601e+02 1.23731425e+01 -1.07024060e-02 1.27784785e+02
1716.lowfreq: -0.0032 -0.0018 -0.0016 4.9594 5.4841 8.0940 16.8947 33.5495 34.5120
frequency: 16.8572 33.5483 34.4886 65.7499 76.1111 98.1253 126.6713 143.8493 166.1075 187.9701 195.1908 204.5341 204.5798 216.8294 231.8799 306.6654 325.8803 326.3292 327.7643 338.1866 355.3504 373.2466 442.2770 445.3327 450.5699 537.4312 599.0196 607.3441 614.9112 638.1461 638.7106 666.1822 734.3710 752.2164 780.1196 815.7933 824.4796 839.6510 869.1292 954.5809 1001.0133 1047.0070 1083.5648 1134.0697 1142.8073 1237.0725 1257.9122 1310.1227 1328.4872 1345.2222 1362.6260 1381.4989 1465.8051 1515.2546 1551.4897 1562.4195 1596.8620 3152.0936 3179.6514 3182.6123
redmass: 13.3121 23.5017 20.7735 34.0228 28.8111 24.6583 7.3071 21.2759 6.6500 16.1447 15.9792 33.6265 31.4472 34.5696 21.7494 27.1588 11.1792 12.4229 19.9431 6.8381 32.1142 11.9670 3.4022 10.1193 8.5716 6.4323 12.0493 7.1011 11.2126 10.3204 8.1348 8.0423 4.3443 10.3894 11.4515 4.9169 1.7558 9.4379 1.4211 1.3596 8.4543 4.2328 2.7358 3.8119 1.5667 2.2470 2.1573 11.9855 12.0013 4.6713 5.1770 4.9535 3.2176 11.9869 11.3138 8.4839 7.6990 1.0898 1.0957 1.0945
irintensity: 0.1392 0.0245 0.0220 0.0000 0.0178 0.0643 0.7906 0.0900 0.0006 0.2139 0.9405 0.0346 0.0435 0.0002 0.0439 0.0518 0.0908 0.0000 0.0910 0.2997 0.2826 3.9781 4.6298 24.2449 7.3188 0.6142 0.0287 0.2850 11.9860 0.9427 83.3791 6.3795 10.6908 101.4422 0.2007 6.0727 13.4223 4.4929 18.3895 0.1827 10.2306 29.7367 48.1134 1.6033 3.8463 23.5599 35.4299 171.2190 11.4525 8.3888 83.0292 56.2112 51.0451 0.0376 22.4189 27.3002 45.1699 2.8158 0.4061 1.8214
temp: 298.150 k
press: 1.00000 atm
elementType: 17 17 17 17 17 17 17 6 6 6 6 6 6 6 6 6 6 6 6 1 1 1
symmnumber: 1
zpe: 289518.9 jmol-1
zpe.correction: 0.110272 hartree
zpe.thermalcorrener: 0.128672 hartree
zpe.thermalcorrenthalpy: 0.129616 hartree
zpe.thermalcorrgfe: 0.060179 hartree
zpe.sumelectzpe: -3678.152562 hartree
zpe.sumelectthermal: -3678.134162 hartree
zpe.sumelectthermalent: -3678.133218 hartree
zpe.sumelectthermalfe: -3678.202655 hartree
dipole: -0.6415 0.0007 -1.4779
dipole: 1.6111
quadrupole: -160.3089 -160.0370 -150.9527
quadrupole: -0.0007 1.3621 -0.0042
quadrupole: -3.2093 -2.9375 6.1468 -0.0007 1.3621 -0.0042
hfenergy: -3678.2628337 hartree
pointgroup: C01 [X(C12H3Cl7)]
dipole: -0.2585394 0.0005411 -0.5787443 debye
dipolederiv: -0.2454786 0.2684899 -0.0009841 0.2739464 -0.5109459 0.0042035 -0.0090853 0.0034091 0.0034817 -0.2453715 -0.2684263 -0.0013695 -0.2738878 -0.5110291 -0.0049315 -0.0094473 -0.0041158 0.0034688 -0.2756216 0.0001805 -0.222436 0.0002137 -0.0360038 0.0005121 -0.2447344 0.0005059 -0.5959486 -0.2185702 0.2882367 0.0022355 0.3346158 -0.4977404 -0.001253 -0.002795 0.0021369 0.0159225 -0.2184881 -0.288215 0.0018731 -0.3345633 -0.4978237 0.0006041 -0.0032061 -0.0027821 0.0159157 -0.727151 -0.0000862 -0.0030673 -0.0000916 -0.0031442 -0.0000152 -0.0095521 -0.0000092 0.0176871 -0.9389566 -0.0000445 -0.0635475 -0.0000903 -0.051284 0.0000662 -0.0280915 0.0000664 -0.1223428 0.3001863 0.0001042 -0.0456236 0.0000976 -0.2919481 -0.0002054 -0.0519511 -0.0002099 0.0205091 0.1690924 0.0001032 -0.1000872 0.0000643 -0.0108634 0.0002052 -0.0807147 0.0002376 -0.2469969 0.2155049 -0.4503951 0.0087498 -0.4837669 0.6372803 -0.0068944 0.0045852 0.0078074 -0.0304971 0.2152899 0.4503094 0.0093942 0.4836852 0.6374446 0.0079084 0.0052289 -0.0068817 -0.0304865 0.3559775 -0.0003196 0.4019425 -0.0001025 -0.028474 -0.0008711 0.2108289 -0.0008697 0.9102859 0.0045063 -0.0000065 0.0207151 -0.0001811 -0.078837 -0.000184 0.1599615 -0.0001586 0.0995515 -0.0146368 -0.5380835 -0.0014702 -0.5934374 0.6069599 -0.0030967 0.0055444 -0.003685 -0.026406 -0.0148485 0.5379598 -0.0007828 0.5933613 0.6071167 0.0038242 0.0063318 0.0044631 -0.026402 1.0006764 0.0001392 0.0119763 0.0001041 -0.2054215 -0.0000939 0.0129327 -0.0001153 -0.0223928 -0.5021033 0.0001368 -0.2084443 0.0000797 -0.0577812 0.0001575 -0.1432748 0.0001496 -0.2447687 -0.4280744 -0.000115 0.0774995 -0.0000978 -0.1005021 -0.0000576 0.0622634 -0.0000707 -0.0399993 1.4208085 0.0001143 0.0696189 0.0001443 -0.0585655 -0.0003 0.0549298 -0.0002843 0.2447935 0.0431708 -0.0000809 0.0674673 -0.0000894 0.127574 0.0001517 0.0840603 0.0001384 -0.0045566 0.0635629 -0.0000427 0.032459 -0.0000515 0.1622403 0.0001187 0.0290727 0.0001191 0.0491285 0.0405247 0.0000414 -0.0561189 0.000047 0.1617481 0.0001512 -0.0528873 0.0001488 0.0100529 unknown
polarizability: 288.3676737|0.0036155|184.1585961|10.6687583|0.0193546|127.5402289 unknown
InChI: InChI=1S/C12H3Cl7/c13-4-1-2-5(6(14)3-4)7-8(15)10(17)12(19)11(18)9(7)16/h1-3H
charge 0 multiplicity 1
22 atoms
Cl 0.16041 2.772222 -0.115934
Cl 0.16097 -2.771807 -0.119761
Cl -1.123826 -0.002676 2.643093
Cl 3.379346 -2.782769 -0.074392
Cl 3.378939 2.783671 -0.070923
Cl 4.986705 0.000703 -0.047237
Cl -5.801344 -0.000294 -0.321778
C  0.334643 0.000234 -0.121733
C  -1.163076 0.000095 -0.158172
C  1.067758 1.212685 -0.109707
C  1.067991 -1.212082 -0.111365
C  -1.943737 -0.001193 1.022272
C  -1.846602 0.001296 -1.400092
C  2.481487 -1.224719 -0.08785
C  2.481256 1.225538 -0.086294
C  3.189598 0.000481 -0.075486
C  -3.351546 -0.001341 0.993711
C  -3.255284 0.001196 -1.467061
C  -3.986648 -0.000124 -0.262849
H  -1.263302 0.002317 -2.326556
H  -3.929919 -0.00236 1.920782
H  -3.770321 0.002126 -2.431268
