program: Gaussian 09
title: 000053044
version: EM64L-G09RevD.01
frameworkgroup: C1[X(C13H21NO2)]
method: RPBEPBE
basis: SDD
operation: Freq
keyword: #p
keyword: freq=noraman
keyword: PBEPBE/SDD
title: #p freq=noraman PBEPBE/SDD
converged: YES YES NO NO
title: Mulliken charges:
elementType: O O N C C C C C C C C C C C C C H H H H H H H H H H H H H H H H H H H H H
charge: -0.312026 -0.292078 -0.420476 -0.164983 -0.135547 -0.077742 -0.086130 -0.060979 -0.488402 -0.469195 -0.474254 -0.470606 -0.462771 0.255026 -0.216794 -0.675632 0.219256 0.241160 0.198452 0.198024 0.259597 0.188153 0.205750 0.197683 0.207295 0.208139 0.199506 0.197849 0.207151 0.198238 0.196756 0.317702 0.225689 0.222459 0.209355 0.227425 0.226947
chargesum: 0.00000
title: Mulliken charges with hydrogens summed into heavy atoms:
elementType: O O N C C C C C C C C C C C C C
charge: -0.312026 -0.292078 -0.102773 0.054274 0.105613 0.120710 0.111894 0.198618 -0.094499 -0.064216 -0.066608 -0.065606 -0.067777 0.255026 0.231354 -0.011905
polarizability: 1.78562438e+02 -5.99857559e-01 1.32595285e+02 2.68138843e+00 1.40132422e+00 1.20820020e+02
1716.lowfreq: -18.3084 -11.8511 0.0002 0.0008 0.0011 9.7352 31.1029 40.4863 61.7950
frequency: -2.5349 32.4914 61.1819 63.8021 114.3964 155.7445 206.2973 247.7413 256.8248 289.0676 307.6547 346.8639 358.5700 374.0012 418.9268 425.2145 438.2381 443.0235 545.4450 560.7307 629.1555 632.9646 665.9885 685.2537 702.3448 754.7072 790.3053 798.4951 801.4403 810.4482 850.0706 866.3944 871.5735 906.3375 914.7987 930.0854 961.8320 971.9593 983.8071 1016.6178 1037.3478 1041.2369 1048.3641 1068.2265 1077.2380 1097.4103 1099.8313 1106.5321 1109.2772 1113.1041 1117.0744 1130.9504 1139.4585 1176.0531 1188.7865 1212.6243 1246.4840 1252.9179 1270.4990 1288.3163 1294.1293 1297.9185 1305.1941 1317.4203 1324.9339 1326.5916 1338.3743 1343.1558 1350.6695 1354.2549 1359.7168 1365.8115 1372.6499 1397.5758 1456.0480 1457.0406 1461.7899 1462.4726 1470.4660 1475.2673 1478.5863 1487.3462 1493.8222 1661.4752 2954.9906 2961.5010 2966.0276 2967.4414 2969.3374 2993.1868 2993.3760 2995.0152 3003.1011 3003.9993 3005.2443 3012.0302 3018.3229 3019.5724 3023.9054 3028.2796 3029.6802 3061.1351 3090.5270 3103.6450 3564.9306
redmass: 2.2186 4.0809 4.0188 4.1409 3.3539 3.9377 5.7416 1.2007 3.3272 3.2231 2.0444 3.1854 3.0547 2.1950 2.2810 1.8647 2.8584 3.1989 1.1682 4.6998 3.6525 4.0503 3.7979 5.5973 10.4859 4.3813 2.9834 1.1455 2.5141 2.8096 2.9500 1.5945 1.5608 2.0999 2.1035 2.2834 2.3390 2.6352 2.4032 4.7762 3.0916 1.7968 1.8020 1.5761 1.9250 1.5830 1.4914 1.0677 2.0749 1.0158 1.0285 3.6115 1.4726 1.3343 1.6871 1.0583 1.1346 1.7244 1.7022 1.8891 1.9608 2.0853 2.1873 1.4635 1.3207 1.3129 1.3826 1.4437 1.3788 1.4142 1.4971 1.5483 1.5137 1.2648 1.1514 1.0929 1.3380 1.0451 1.0964 1.1129 1.1234 1.1109 1.1625 9.9738 1.0635 1.0619 1.0625 1.0604 1.0621 1.0803 1.0390 1.0835 1.0845 1.0583 1.0858 1.0974 1.0929 1.0981 1.1017 1.1019 1.1018 1.1067 1.0986 1.1024 1.0766
irintensity: 0.2627 0.7578 1.2934 6.3522 3.6965 4.0242 3.0998 0.6517 3.3454 6.4139 0.4229 7.0063 0.5301 0.6041 0.4317 1.3987 0.7661 2.0741 91.1783 3.6792 0.3785 0.3818 3.0576 4.1902 17.2159 2.8289 0.7041 3.3222 5.5327 5.5888 1.0391 0.3879 0.0874 1.7622 0.9176 29.6784 62.2871 16.2066 21.2087 0.7559 137.1993 2.0588 1.6121 2.9767 47.1863 17.2235 9.9673 0.4375 10.9268 0.2237 0.1054 51.5148 4.9184 39.9161 166.8591 0.8283 0.1024 16.9079 26.6540 10.6208 3.1457 1.2127 5.6022 10.4082 0.5141 2.1993 24.6787 3.6463 14.2743 1.8313 0.2053 0.6373 4.5263 31.7205 64.4076 1.7490 181.3041 14.6045 31.6075 89.8784 47.5418 30.8449 63.7580 290.7281 37.4310 29.2591 22.1936 28.9645 26.9509 107.2811 13.9232 164.5760 55.2553 28.8458 38.2195 55.4054 12.4768 3.3844 35.6657 75.0918 85.4480 11.2044 34.9494 49.0571 28.9771
temp: 298.150 k
press: 1.00000 atm
elementType: 8 8 7 6 6 6 6 6 6 6 6 6 6 6 6 6 1 1 1 1 1 1 1 1 1 1 1 1 1 1 1 1 1 1 1 1 1
symmnumber: 1
zpe: 851923.5 jmol-1
zpe.correction: 0.324481 hartree
zpe.thermalcorrener: 0.338230 hartree
zpe.thermalcorrenthalpy: 0.339175 hartree
zpe.thermalcorrgfe: 0.283667 hartree
zpe.sumelectzpe: -711.961444 hartree
zpe.sumelectthermal: -711.947695 hartree
zpe.sumelectthermalent: -711.946750 hartree
zpe.sumelectthermalfe: -712.002258 hartree
dipole: 1.1037 2.2320 0.2331
dipole: 2.5008
quadrupole: -87.1315 -101.7656 -95.6554
quadrupole: -4.1862 0.9564 -0.0252
quadrupole: 7.7193 -6.9147 -0.8046 -4.1862 0.9564 -0.0252
hfenergy: -712.2859249 hartree
pointgroup: C01 [X(C13H21N1O2)]
dipole: 0.4394009 0.87146 0.1247342 debye
polarizability: 178.5338903|-0.99667|132.4897596|2.854739|1.8018108|120.9540935 unknown
InChI: InChI=1S/C13H21NO2/c1-2-16-13(15)14-12-10-4-8-3-9(6-10)7-11(12)5-8/h8-12,14H,2-7H2,1H3
charge 0 multiplicity 1
37 atoms
O  -3.27804 0.42829 0.147595
O  -2.319963 -1.718032 -0.111361
N  -1.034447 0.178215 0.420523
C  1.265689 0.236802 1.381691
C  0.907908 -0.627424 -0.982355
C  2.251979 1.494774 -0.595736
C  3.212361 -0.757357 0.080109
C  0.273743 -0.502717 0.438751
C  1.616297 1.642507 0.814574
C  2.568306 -0.604306 1.485362
C  1.246849 0.78002 -1.541767
C  2.207857 -1.469002 -0.867106
C  3.550763 0.649507 -0.486575
C  -2.199831 -0.487283 0.130036
C  -4.613608 -0.166115 -0.129575
C  -5.607714 0.991504 -0.163603
H  0.802966 0.336001 2.383665
H  0.184202 -1.140325 -1.64362
H  2.494136 2.497973 -0.998888
H  4.138661 -1.359533 0.16183
H  0.091449 -1.524205 0.825582
H  0.720519 2.296064 0.761219
H  2.3253 2.146209 1.501395
H  3.276732 -0.104663 2.176033
H  2.343304 -1.602026 1.9125
H  0.323758 1.384034 -1.649677
H  1.684711 0.682168 -2.555045
H  2.657867 -1.598683 -1.871548
H  1.972504 -2.482057 -0.48328
H  4.022735 0.551949 -1.48481
H  4.281846 1.159218 0.173257
H  -1.091297 1.184739 0.578069
H  -4.568616 -0.710581 -1.090358
H  -4.848349 -0.896451 0.666611
H  -6.624673 0.607635 -0.364563
H  -5.622631 1.526969 0.801395
H  -5.344273 1.711782 -0.957231
