program: Gaussian 09
title: 000053068
version: EM64L-G09RevD.01
frameworkgroup: C1[X(C22H27NO5)]
method: RPBEPBE
basis: SDD
operation: Freq
keyword: #p
keyword: freq=noraman
keyword: PBEPBE/SDD
title: #p freq=noraman PBEPBE/SDD
converged: YES YES NO NO
title: Mulliken charges:
elementType: O O O O O N C C C C C C C C C C C C C C C C C C C C C C H H H H H H H H H H H H H H H H H H H H H H H H H H H
charge: -0.312523 -0.301370 -0.455467 -0.298912 -0.300453 -0.108214 -0.154397 0.028547 -0.691253 0.262915 -0.420105 0.157361 -0.541089 0.456454 0.146673 0.316477 -0.017943 -0.643590 -0.060446 -0.649168 -0.506124 -0.577391 0.202803 0.184350 -0.525303 -0.527961 -0.530347 -0.530027 0.206816 0.244424 0.231036 0.196324 0.213007 0.246911 0.231171 0.188524 0.228573 0.225586 0.259308 0.314579 0.250926 0.203704 0.339241 0.222493 0.224027 0.259807 0.241089 0.220839 0.246826 0.226706 0.220760 0.257809 0.219864 0.248735 0.227415
chargesum: 0.00000
title: Mulliken charges with hydrogens summed into heavy atoms:
elementType: O O O O O N C C C C C C C C C C C C C C C C C C C C C C
charge: -0.312523 -0.301370 -0.116226 -0.298912 -0.300453 -0.108214 0.052419 0.028547 -0.215793 0.262915 -0.010774 0.157361 -0.063007 0.456454 0.146673 0.316477 -0.017943 -0.000907 -0.060446 -0.389860 -0.191544 -0.122760 0.202803 0.184350 0.181023 0.180794 0.174928 0.165987
polarizability: 3.91446845e+02 -1.47169792e+00 2.96481152e+02 -1.21777362e+00 -4.52908733e+00 1.59664514e+02
1716.lowfreq: -2.0145 -0.0007 -0.0005 0.0005 3.5388 8.4433 29.3712 34.1312 42.4411
frequency: 29.2976 34.0731 42.4328 46.8660 63.2568 80.2406 84.5706 86.1289 90.9449 102.8682 111.0541 138.6793 143.6189 155.9299 157.6930 163.8477 177.2205 179.5685 188.9880 200.4567 220.6816 229.8334 234.5815 264.2184 266.1753 280.3382 281.7601 294.3477 299.8638 318.0096 339.6239 347.6374 365.3352 372.7594 400.3725 411.2070 444.3343 448.7393 459.2053 482.4798 495.0283 504.5349 526.3048 539.5246 573.6396 603.5307 629.0692 675.0645 682.9323 707.0042 714.2246 725.9167 733.1335 750.3600 772.0386 800.7110 825.9251 838.4247 887.4032 900.1695 905.2251 916.8648 921.7877 927.3519 945.1880 965.1334 975.5095 989.0149 1001.2950 1020.1572 1045.2586 1070.6402 1076.4407 1089.7155 1096.3541 1108.4292 1112.6116 1112.9774 1114.7517 1117.7331 1129.0110 1148.8002 1150.5739 1153.5884 1155.9329 1158.2853 1166.1262 1177.1249 1186.1375 1208.8445 1216.3247 1229.2131 1233.1539 1241.4259 1257.7614 1267.9879 1294.4122 1313.2347 1315.4959 1336.1183 1341.2917 1356.7615 1368.5085 1372.8949 1384.1781 1400.5217 1410.1658 1423.5566 1427.2982 1430.9879 1434.3811 1441.6018 1449.9286 1450.9056 1453.4524 1456.6022 1457.8606 1458.7570 1462.4096 1468.4908 1476.5599 1476.7817 1477.9485 1481.5609 1482.8917 1484.0778 1486.8702 1490.8345 1550.8412 1573.7078 1590.7890 1615.0648 2776.6871 2845.7852 2861.0246 2965.5940 2967.6513 2970.3828 2972.4128 2972.7010 2973.2909 2980.1294 3033.3779 3036.1345 3039.9363 3042.3261 3059.3051 3063.6940 3070.7163 3071.3071 3074.9847 3091.1815 3114.8914 3115.1846 3116.9969 3120.8629 3143.8906 3196.5135 3536.6672
redmass: 4.0947 3.8732 4.0384 3.6538 3.4234 3.7376 3.5636 2.8804 3.6862 2.9108 3.3501 2.0228 3.1391 1.2583 1.1499 1.2892 1.3570 1.6414 1.9038 2.6745 3.0015 2.7409 4.1039 3.8220 2.5047 3.8473 1.1741 4.8280 5.0141 3.7858 3.8776 3.9507 4.3136 4.2371 5.2702 3.7728 4.3399 4.9229 4.4722 3.5606 4.4137 4.0172 3.5662 4.5190 4.8269 5.4275 4.9326 5.7543 5.4118 4.0274 5.7092 5.7235 5.5107 3.4221 4.2536 4.8878 3.9395 3.4180 1.5498 5.5138 3.6075 2.2327 3.5402 4.1424 4.8199 3.9653 3.0272 2.5342 3.0086 2.4696 1.9850 2.5872 4.6432 2.2665 2.7412 1.2507 1.2442 1.4138 1.2456 1.2649 2.5211 1.4786 1.5784 1.3967 1.4003 1.4407 1.7796 1.8308 1.3563 1.3494 1.4007 1.6854 2.5178 1.5140 3.3424 1.3369 1.6433 4.1361 1.5929 1.7958 2.3994 3.1399 3.8701 1.5898 3.3129 1.4499 1.9264 1.3872 1.3539 1.5332 1.1862 1.5102 1.3453 1.5819 1.1690 1.0757 1.0627 1.0911 1.0600 1.0695 1.0568 1.0568 1.1093 1.0598 1.0622 1.1442 1.0527 3.0010 8.3158 8.6827 9.5002 7.3977 1.0778 1.0677 1.0606 1.0308 1.0615 1.0297 1.0327 1.0339 1.0575 1.0646 1.0869 1.0736 1.0989 1.1004 1.1041 1.0958 1.1028 1.1051 1.1036 1.0992 1.1030 1.1021 1.1034 1.1032 1.0916 1.0915 1.0662
irintensity: 0.3349 4.0986 0.1334 0.6043 4.1572 4.4313 0.5918 3.6242 1.6608 9.7230 4.3101 2.3844 4.7161 0.2883 0.3027 1.0915 1.8868 1.4725 0.0988 1.2182 1.8079 6.0050 2.6295 7.7431 2.4310 6.8165 138.2189 9.9107 0.9980 5.4951 3.5096 2.8343 2.0843 3.3856 2.8255 2.1322 9.0607 5.9791 3.0171 5.8984 0.5654 4.6126 1.9360 2.5581 7.8854 21.8327 8.1554 18.5991 1.4592 13.8148 7.8394 4.3893 22.6404 3.4143 5.2011 6.5117 9.9599 7.1152 14.9183 2.8751 11.3775 17.5030 31.7639 64.2355 98.0047 71.4468 42.8941 17.6403 1.7126 24.4952 13.5180 11.0230 149.4428 20.3344 16.9138 2.4903 11.1835 7.1265 11.4156 1.6642 24.8737 5.5345 6.8410 1.2067 2.8702 8.2768 22.6453 37.6316 52.4428 5.4165 3.4986 9.3000 62.5174 12.5630 66.4335 12.7041 31.7434 76.4264 13.2349 37.6325 54.3329 21.4843 30.0384 1.2591 61.8284 27.9001 5.5646 3.1420 7.8519 43.1747 3.6730 14.1945 13.8400 16.3474 6.8715 12.1625 7.9921 3.3803 5.1405 10.6727 4.8598 7.1927 17.8393 15.1977 34.4225 30.0394 21.9182 102.8490 27.1660 8.4923 20.5695 4.6659 47.0045 44.9049 180.5672 73.9371 41.0010 69.0739 74.1384 97.7875 32.7398 21.3335 37.0414 63.4131 15.8171 16.0381 29.5314 35.4390 25.4262 20.3556 24.0797 32.0046 31.9936 29.2470 20.2366 28.2339 7.5701 5.7252 6.4122
temp: 298.150 k
press: 1.00000 atm
elementType: 8 8 8 8 8 7 6 6 6 6 6 6 6 6 6 6 6 6 6 6 6 6 6 6 6 6 6 6 1 1 1 1 1 1 1 1 1 1 1 1 1 1 1 1 1 1 1 1 1 1 1 1 1 1 1
symmnumber: 1
zpe: 1176098.3 jmol-1
zpe.correction: 0.447952 hartree
zpe.thermalcorrener: 0.476438 hartree
zpe.thermalcorrenthalpy: 0.477382 hartree
zpe.thermalcorrgfe: 0.389304 hartree
zpe.sumelectzpe: -1283.237135 hartree
zpe.sumelectthermal: -1283.208649 hartree
zpe.sumelectthermalent: -1283.207705 hartree
zpe.sumelectthermalfe: -1283.295783 hartree
dipole: 1.2226 -0.0247 -0.4257
dipole: 1.2948
quadrupole: -137.7124 -147.5106 -168.2899
quadrupole: 0.8113 -1.9877 5.9596
quadrupole: 13.4585 3.6604 -17.1189 0.8113 -1.9877 5.9596
hfenergy: -1283.685087 hartree
pointgroup: C01 [X(C22H27N1O5)]
dipole: -0.4808462 0.0148714 -0.1675343 debye
polarizability: 391.3723934|-3.0335122|296.6710828|1.2362312|2.1620599|159.5490351 unknown
InChI: InChI=1S/C22H27NO5/c1-23-7-6-13-15(11-24)21(27-4)22(28-5)20-14-10-18(26-3)17(25-2)9-12(14)8-16(23)19(13)20/h9-10,16,24H,6-8,11H2,1-5H3
charge 0 multiplicity 1
55 atoms
O  -0.099318 2.690567 -0.249742
O  -2.869006 3.03172 -0.351809
O  -5.223594 0.771446 1.154385
O  5.268821 -0.963258 -0.144354
O  4.339279 1.665561 0.766525
N  -1.62783 -3.364508 -0.212772
C  -0.644853 -2.280424 0.04581
C  -1.265459 -0.87917 -0.058054
C  0.554838 -2.342334 -0.928923
C  -2.666655 -0.693922 -0.099836
C  -2.883144 -3.127539 0.540394
C  -0.364749 0.239245 -0.110963
C  -3.6002 -1.891444 -0.014582
C  1.573089 -1.294028 -0.523542
C  1.104318 -0.013838 -0.090163
C  -3.214881 0.617269 -0.198019
C  -0.927843 1.542517 -0.212945
C  -1.077683 -4.70756 0.070553
C  -2.335818 1.720662 -0.241732
C  2.953644 -1.577025 -0.523755
C  2.061987 0.94714 0.333656
C  -4.704162 0.855317 -0.243332
C  3.898056 -0.619133 -0.09875
C  3.440071 0.662376 0.317765
C  -0.094736 3.405047 -1.547622
C  -2.851889 3.773209 0.932356
C  5.96604 -0.926377 1.163321
C  5.2280 2.190969 -0.294466
H  -0.229941 -2.387075 1.088312
H  0.17254 -2.165479 -1.954536
H  1.025222 -3.339631 -0.917854
H  -2.686686 -2.992766 1.635674
H  -3.529644 -4.017119 0.429413
H  -4.465346 -1.642437 0.627278
H  -3.989468 -2.13349 -1.023823
H  -0.706552 -4.816787 1.121663
H  -0.246158 -4.946594 -0.612604
H  -1.867466 -5.461212 -0.094261
H  3.322786 -2.559464 -0.837366
H  1.743187 1.935641 0.666562
H  -4.901467 1.859939 -0.659524
H  -5.204357 0.089985 -0.870977
H  -6.198494 0.95609 1.132469
H  0.307506 2.747901 -2.34178
H  0.570468 4.270568 -1.40354
H  -1.115355 3.740118 -1.802323
H  -3.47985 3.247528 1.676184
H  -3.273559 4.765763 0.709407
H  -1.815182 3.871756 1.302175
H  7.018683 -1.157655 0.939418
H  5.545652 -1.697699 1.83644
H  5.875309 0.069146 1.632987
H  4.628873 2.682753 -1.084784
H  5.837454 1.38196 -0.738082
H  5.873924 2.93207 0.20117
