program: Gaussian 09
title: 000053055
version: EM64L-G09RevD.01
frameworkgroup: C1[X(C12H17N3O3)]
method: RPBEPBE
basis: SDD
operation: Freq
keyword: #p
keyword: freq=noraman
keyword: PBEPBE/SDD
title: #p freq=noraman PBEPBE/SDD
converged: YES YES NO NO
title: Mulliken charges:
elementType: O O O N N N C C C C C C C C C C C C H H H H H H H H H H H H H H H H H
charge: -0.302778 -0.311765 -0.281941 -0.035047 -0.336656 0.062679 -0.561941 0.493094 -0.424435 0.036959 -0.369419 -0.375328 -0.682829 -0.684083 0.343423 -0.221332 -0.241130 -0.241310 0.246999 0.226388 0.254161 0.276497 0.233807 0.346281 0.252581 0.246753 0.207770 0.232050 0.223828 0.207408 0.267042 0.219408 0.228404 0.233993 0.230472
chargesum: 0.00000
title: Mulliken charges with hydrogens summed into heavy atoms:
elementType: O O O N N N C C C C C C C C C C C C
charge: -0.302778 -0.311765 -0.281941 -0.035047 0.009626 0.062679 -0.088555 0.493094 0.106223 0.270765 -0.116839 -0.128575 -0.019181 0.009775 0.343423 0.007072 -0.007137 -0.010838
polarizability: 1.58833502e+02 -2.59146075e+01 1.67397146e+02 -9.97547372e+00 3.21817113e+00 1.42073581e+02
1716.lowfreq: -7.1717 -4.1157 -0.0006 0.0003 0.0004 6.7310 8.2267 24.3097 32.8332
frequency: 3.3127 24.1812 32.6997 43.7627 48.3110 63.9818 90.7774 100.1673 131.7218 172.3584 196.4009 219.4125 244.1768 257.4761 276.7087 307.8898 321.0114 368.1366 385.1129 388.9508 401.0175 418.9638 455.6546 467.9387 547.7855 584.2085 615.7548 629.8473 648.5532 681.8334 702.4442 702.9893 762.2399 789.4771 809.5507 833.0987 852.1852 878.7449 903.2438 924.2418 926.5104 930.5929 941.3975 978.3075 989.6890 993.6599 998.8373 1026.9638 1066.3383 1098.6259 1105.2520 1125.7288 1156.9589 1173.1026 1174.6295 1179.6224 1191.6853 1203.3758 1209.7286 1270.3898 1319.3538 1321.3669 1333.6706 1340.1207 1346.3780 1348.0086 1381.2447 1385.1817 1396.5725 1397.4404 1428.5311 1443.5171 1454.2635 1457.1611 1464.7063 1472.9440 1480.5124 1484.5721 1488.6516 1596.0378 1613.0136 1641.6622 2987.4539 2992.9365 3017.9706 3027.6694 3036.4656 3080.2109 3083.0580 3093.3811 3098.4582 3103.3949 3116.8279 3121.0022 3126.6285 3138.5526 3149.3447 3164.3610 3572.0914
redmass: 4.0020 4.1541 3.1143 5.2112 4.2129 6.7456 8.4170 5.3990 4.2257 5.7694 1.0319 3.4063 1.3877 3.9444 3.4850 4.2668 5.1029 3.2018 2.3567 2.6604 2.7915 2.7881 3.0623 3.5611 3.3271 4.4997 6.0654 1.2877 3.9112 5.3421 5.1219 2.0004 2.2427 3.5656 3.8587 4.2063 1.2792 2.9974 2.0983 1.6114 1.5462 2.0610 1.3917 1.3978 5.3086 3.6317 1.3550 2.2482 2.1478 1.7117 1.7261 5.4095 2.0332 1.0550 2.6138 2.0783 1.1567 2.0747 2.9229 1.8893 1.7589 1.4215 1.3614 1.3263 2.1786 1.2950 1.2946 4.4583 1.3084 1.2259 1.1000 2.1434 1.1223 1.0528 1.0529 1.0788 1.6995 2.1628 1.0782 6.0582 5.9798 8.8172 1.0357 1.0358 1.0588 1.0866 1.0607 1.1045 1.0992 1.0988 1.1007 1.1004 1.1028 1.0860 1.0873 1.0920 1.0964 1.1016 1.0777
irintensity: 0.3139 1.6771 1.0565 1.2538 0.7627 1.7594 13.1606 0.0895 4.7286 1.5516 0.1258 4.1076 0.4363 7.2221 3.2880 1.4184 1.3087 3.6004 6.3836 12.6388 0.3600 1.8887 2.8800 6.5267 6.8428 18.6970 2.9933 133.8060 19.8079 3.1990 13.2238 84.8685 24.1070 16.1961 0.7411 44.0224 2.0776 18.3147 50.5528 54.3706 30.1095 17.9127 0.9984 0.9276 32.1008 101.6544 3.5434 1.6110 61.3369 47.0926 72.6970 86.7153 11.1593 0.3390 13.3846 99.9584 2.1667 197.6432 26.2961 79.5521 62.4781 13.8614 27.9885 2.8151 27.4184 15.3168 26.1558 3.5447 1.8462 19.6847 42.6508 6.6798 17.2861 4.7292 8.0607 18.8190 257.2270 7.0817 57.5233 0.9434 1.1123 199.9822 12.7010 23.3976 24.2236 6.4316 21.8584 5.7822 8.5749 47.8959 15.3908 32.5819 2.0174 2.0349 0.1707 13.8334 30.6793 17.1492 45.5358
temp: 298.150 k
press: 1.00000 atm
elementType: 8 8 8 7 7 7 6 6 6 6 6 6 6 6 6 6 6 6 1 1 1 1 1 1 1 1 1 1 1 1 1 1 1 1 1
symmnumber: 1
zpe: 738888.1 jmol-1
zpe.correction: 0.281428 hartree
zpe.thermalcorrener: 0.300030 hartree
zpe.thermalcorrenthalpy: 0.300974 hartree
zpe.thermalcorrgfe: 0.229953 hartree
zpe.sumelectzpe: -855.995793 hartree
zpe.sumelectthermal: -855.977190 hartree
zpe.sumelectthermalent: -855.976246 hartree
zpe.sumelectthermalfe: -856.047267 hartree
dipole: -1.8351 2.0441 1.2693
dipole: 3.0261
quadrupole: -101.7444 -106.1764 -107.9081
quadrupole: 1.6889 8.3326 -8.8999
quadrupole: 3.5319 -0.9001 -2.6318 1.6889 8.3326 -8.8999
hfenergy: -856.2772202 hartree
pointgroup: C01 [X(C12H17N3O3)]
dipole: -0.3984974 -0.9360853 -0.6183354 debye
polarizability: 143.4174987|12.0025904|182.7185448|9.7973936|13.2498057|142.1681846 unknown
InChI: InChI=1S/C12H17N3O3/c1-10(2)18-12(16)13-9-15(14-17)8-11-6-4-3-5-7-11/h3-7,10,13H,8-9H2,1-2H3
charge 0 multiplicity 1
35 atoms
O  -2.603643 -0.387852 0.831806
O  -1.950036 0.143887 -1.376875
O  0.788933 3.247884 1.831918
N  0.9011 2.290607 -0.193327
N  -1.335393 1.458797 0.467912
N  1.567683 2.763687 0.921591
C  1.74681 1.593756 -1.194716
C  1.835725 0.082756 -0.990133
C  -0.576612 2.426999 -0.305291
C  -3.297093 -1.633341 0.342441
C  2.597279 -0.436758 0.088364
C  1.188055 -0.812316 -1.875057
C  -4.423597 -1.884757 1.34698
C  -2.269822 -2.770618 0.256062
C  -1.95426 0.380161 -0.137849
C  2.715449 -1.831104 0.273031
C  1.308982 -2.209505 -1.69294
C  2.074338 -2.721978 -0.62102
H  2.748851 2.049348 -1.10189
H  1.350052 1.828665 -2.197839
H  -0.843137 2.301925 -1.365857
H  -0.819485 3.445168 0.0442
H  -3.696326 -1.404812 -0.663329
H  -1.384552 1.559732 1.482635
H  3.093929 0.254111 0.780904
H  0.575326 -0.420915 -2.695053
H  -4.999436 -2.779954 1.049877
H  -5.112104 -1.023704 1.389486
H  -4.012736 -2.054806 2.357718
H  -2.762765 -3.696767 -0.093557
H  -1.463108 -2.517833 -0.452259
H  -1.823473 -2.965874 1.247358
H  3.308223 -2.223154 1.107046
H  0.806386 -2.893071 -2.386305
H  2.170357 -3.804664 -0.481334
