program: Gaussian 09
title: 000053106
version: EM64L-G09RevD.01
frameworkgroup: C1[X(C18H21N3)]
method: RPBEPBE
basis: SDD
operation: Freq
keyword: #pfreq=noraman
keyword: PBEPBE/SDD
title: #p freq=noraman PBEPBE/SDD
converged: YES YES NO NO
title: Mulliken charges:
elementType: N N N C C C C C C C C C C C C C C C C C C H H H H H H H H H H H H H H H H H H H H H
charge: -0.207233 -0.297250 -0.088471 0.255106 0.116020 0.231046 -0.407710 -0.357780 -0.351144 0.343285 -0.371041 -0.367747 -0.213364 -0.266922 -0.400586 -0.410425 -0.617460 -0.613111 -0.235066 -0.244045 -0.250661 0.270437 0.198326 0.254591 0.275508 0.234570 0.161610 0.255468 0.239537 0.220384 0.219680 0.228270 0.243816 0.228880 0.222122 0.187470 0.188394 0.230359 0.223706 0.221295 0.223578 0.226558
chargesum: 0.00000
title: Mulliken charges with hydrogens summed into heavy atoms:
elementType: N N N C C C C C C C C C C C C C C C C C C
charge: -0.207233 -0.021742 -0.088471 0.255106 0.116020 0.231046 -0.137273 0.095137 0.045036 0.343285 -0.115573 -0.128210 0.007019 -0.047242 -0.172316 -0.166609 0.021011 0.029347 -0.013771 -0.020467 -0.024103
polarizability: 2.87966473e+02 -2.96679788e+01 2.53719087e+02 2.60780450e+01 1.99982441e+01 1.35446600e+02
1716.lowfreq: -9.1107 -5.2956 -2.5340 -0.0005 -0.0004 -0.0003 19.8124 30.3617 35.5568
frequency: 19.6779 30.3490 35.1549 50.8391 78.4504 81.5270 91.2451 102.5067 153.9065 182.6914 214.6828 221.5095 230.5264 236.4230 243.3448 286.6353 301.3351 329.2633 351.2477 385.0737 406.8230 430.6117 433.7178 462.1633 493.9419 555.5599 573.2926 579.1350 596.0545 614.0339 634.4061 640.5562 693.8305 703.2826 752.7879 754.8104 762.8170 767.4707 775.2518 792.7405 811.1348 829.2860 850.5500 861.4869 916.4265 931.3123 942.5673 972.5985 976.2027 988.3356 990.7377 1010.9246 1017.1179 1028.3524 1033.0374 1034.3129 1072.5559 1077.5495 1082.9784 1092.7037 1095.1145 1124.2874 1139.9213 1142.9614 1161.8284 1171.1299 1180.2315 1191.2271 1202.4851 1244.0208 1256.6125 1265.1214 1297.8879 1301.7200 1310.0364 1324.5509 1341.9523 1368.4097 1373.4617 1387.8057 1407.2932 1419.9898 1435.3283 1436.3032 1442.2842 1462.1536 1464.1162 1464.8441 1473.7358 1476.3518 1481.2341 1485.0022 1487.2300 1491.6754 1552.8752 1574.3235 1585.2773 1615.2509 1628.0561 2810.6470 2846.9481 2863.1505 2929.7086 3022.6942 3028.7957 3046.2512 3078.7467 3082.2842 3086.1953 3117.4348 3124.9418 3126.7854 3138.3847 3142.4466 3150.5875 3159.0876 3164.0833 3170.1557 3216.1926 3410.9197
redmass: 4.2571 4.5335 2.5818 3.9694 3.6699 3.3973 3.9620 2.0667 3.4768 3.5369 3.5144 1.1474 3.3478 1.3119 4.0593 4.1268 3.2800 4.5063 2.9527 3.2885 2.8632 2.9371 2.4236 3.2367 3.4986 4.8663 4.4839 4.0777 4.5009 5.8420 3.2359 3.3485 2.4509 1.8014 2.2887 1.2847 3.4160 3.1166 2.6144 1.9395 1.3112 3.5360 1.2606 1.4217 1.4902 5.3093 1.3741 1.4056 1.3269 4.6745 1.3388 2.0269 2.7610 2.2129 1.5070 2.4281 2.2439 1.8011 2.5332 1.3614 1.9870 2.1939 1.5597 1.6101 1.3621 1.0560 1.5099 1.1249 1.6550 1.6588 2.0957 2.5266 1.3827 2.1192 1.8159 1.3450 2.2169 2.5561 6.6392 1.4382 4.6075 1.1413 2.0091 2.2261 1.1950 1.0540 2.1427 1.1658 1.0894 1.0576 2.5904 1.0601 1.8293 1.1159 5.8094 6.0717 6.6589 6.1710 7.3992 1.0708 1.0573 1.0572 1.0698 1.0726 1.0719 1.0859 1.0952 1.0993 1.1006 1.0849 1.0869 1.0853 1.0929 1.0902 1.0951 1.0958 1.1003 1.0986 1.0976 1.0751
irintensity: 0.0432 0.2154 0.3707 0.2548 0.0422 0.8228 0.1585 3.0420 0.3245 0.2194 1.6862 1.7935 2.3797 1.2287 1.6033 1.7372 4.2002 6.8227 5.7981 0.9177 0.2904 8.3769 1.1129 10.9493 4.7856 0.3104 4.6784 12.9350 3.6582 0.6626 5.5613 44.4608 16.2530 46.1913 51.1730 104.1610 4.7022 25.7473 6.7864 11.5860 3.5850 13.0731 0.1280 0.6758 5.0658 6.4410 2.0392 0.5600 0.3138 0.6428 0.8275 18.0454 26.8357 5.8795 10.1831 26.5955 10.0316 4.0479 20.2458 6.1704 44.7441 8.8897 1.0805 4.7591 10.0667 0.0404 2.5314 2.2260 54.3347 20.4089 3.3048 12.4330 5.2868 17.4736 24.8178 3.1694 0.2718 6.0741 0.0958 5.4388 14.6381 3.7391 20.0506 0.8021 3.2914 12.1957 9.3620 1.8099 6.1902 20.1170 14.7899 9.9276 19.0980 10.1077 41.3109 1.9171 1.7612 55.4362 4.8908 94.5540 71.3584 239.3431 52.8173 38.4604 47.2131 11.5491 7.0760 37.0682 53.5003 7.8872 0.2851 2.5176 30.5581 27.0015 28.9343 18.3248 28.9095 19.8234 0.3606 1.8669
temp: 298.150 k
press: 1.00000 atm
elementType: 7 7 7 6 6 6 6 6 6 6 6 6 6 6 6 6 6 6 6 6 6 1 1 1 1 1 1 1 1 1 1 1 1 1 1 1 1 1 1 1 1 1
symmnumber: 1
zpe: 918435.2 jmol-1
zpe.correction: 0.349814 hartree
zpe.thermalcorrener: 0.369360 hartree
zpe.thermalcorrenthalpy: 0.370304 hartree
zpe.thermalcorrgfe: 0.299713 hartree
zpe.sumelectzpe: -861.200836 hartree
zpe.sumelectthermal: -861.181290 hartree
zpe.sumelectthermalent: -861.180345 hartree
zpe.sumelectthermalfe: -861.250936 hartree
dipole: -3.2323 -1.9011 -1.1629
dipole: 3.9261
quadrupole: -107.7901 -118.4707 -127.2785
quadrupole: 1.6942 7.8037 6.1709
quadrupole: 10.0564 -0.6243 -9.4321 1.6942 7.8037 6.1709
hfenergy: -861.5506491 hartree
pointgroup: C01 [X(C18H21N3)]
dipole: 1.1860181 0.8167655 -0.5587641 debye
polarizability: 291.4031191|-28.9856282|244.6550457|-26.576179|-29.9795863|141.0739947 unknown
InChI: InChI=1S/C18H21N3/c1-20(2)13-12-19-21-14-17(15-8-4-3-5-9-15)16-10-6-7-11-18(16)21/h3-11,14,19H,12-13H2,1-2H3
charge 0 multiplicity 1
42 atoms
N  0.816436 -0.360703 -0.613944
N  2.172279 -0.151604 -0.960451
N  5.230382 1.620128 0.406532
C  0.315249 -1.59341 -0.166388
C  -1.076949 -1.400796 0.142282
C  -1.397715 0.000877 -0.128246
C  -0.215356 0.593192 -0.587702
C  2.928743 0.72701 -0.025157
C  4.419665 0.697557 -0.418573
C  -2.691114 0.692219 0.039732
C  0.969885 -2.835597 -0.041301
C  -1.832021 -2.527508 0.569366
C  0.19852 -3.926729 0.405205
C  -1.189452 -3.774083 0.699433
C  -3.073904 1.75213 -0.831962
C  -3.587266 0.335731 1.087887
C  5.093441 3.036064 0.007824
C  6.648503 1.211816 0.488634
C  -4.296822 2.433321 -0.658571
C  -4.815296 1.010423 1.255418
C  -5.178858 2.063632 0.384452
H  -0.021171 1.630449 -0.856645
H  2.545228 1.771969 -0.015459
H  2.813735 0.323182 0.993925
H  2.251724 0.141422 -1.945529
H  4.788922 -0.33231 -0.267471
H  4.52521 0.919139 -1.515946
H  2.030265 -2.932726 -0.291627
H  -2.90308 -2.438218 0.776768
H  0.667692 -4.91058 0.518669
H  -1.765231 -4.646816 1.027511
H  -2.415238 2.022122 -1.666179
H  -3.30004 -0.446952 1.797793
H  5.648627 3.674632 0.717518
H  4.035135 3.346707 0.037981
H  5.486222 3.239422 -1.022012
H  7.182671 1.251688 -0.494922
H  6.718871 0.1808 0.877283
H  7.182812 1.877114 1.190444
H  -4.569709 3.243209 -1.345078
H  -5.484977 0.720689 2.073388
H  -6.132618 2.586887 0.514818
