program: Gaussian 09
title: 000053036
version: EM64L-G09RevD.01
frameworkgroup: C1[X(C12H5Cl5)]
method: RPBEPBE
basis: SDD
operation: Freq
keyword: #pfreq=noraman
keyword: PBEPBE/SDD
title: #p freq=noraman PBEPBE/SDD
converged: NO NO NO NO
title: Mulliken charges:
elementType: Cl Cl Cl Cl Cl C C C C C C C C C C C C H H H H H
charge: 0.031733 0.045791 0.009860 0.055745 -0.045725 0.444081 0.279095 -0.344895 -0.389176 -0.342118 -0.342075 -0.024325 -0.079539 -0.102340 -0.198043 -0.198034 -0.109208 0.285711 0.251867 0.251867 0.259863 0.259865
chargesum: 0.00000
title: Mulliken charges with hydrogens summed into heavy atoms:
elementType: Cl Cl Cl Cl Cl C C C C C C C C C C C C
charge: 0.031733 0.045791 0.009860 0.055745 -0.045725 0.444081 0.279095 -0.344895 -0.103465 -0.090251 -0.090208 -0.024325 -0.079539 -0.102340 0.061821 0.061831 -0.109208
polarizability: 2.72442425e+02 6.94098461e+00 1.61927810e+02 -2.99828642e-03 1.42374387e-02 1.03858385e+02
1716.lowfreq: -37.4206 0.0023 0.0026 0.0031 2.1194 3.5146 7.9517 35.9012 39.7986
frequency: -37.4205 35.8944 39.7858 77.4282 84.9583 134.7274 164.6720 194.7998 197.1773 210.1168 225.3595 254.4807 286.7166 315.3992 317.0779 335.9465 396.7865 403.0213 423.4042 467.6094 517.2419 537.5257 578.1390 604.8192 608.3111 642.0013 702.8178 720.5095 737.9817 776.7466 825.5924 829.2625 832.0978 883.4339 950.9131 965.3960 996.9881 1015.2766 1072.4916 1098.4847 1106.4097 1167.8399 1185.7119 1266.9281 1292.1269 1320.4882 1342.0901 1352.1262 1388.2854 1399.9398 1479.7975 1526.6032 1571.3793 1576.2327 1602.1500 3145.1994 3146.3637 3171.5158 3171.7019 3174.8674
redmass: 4.0075 20.1586 15.9943 32.0091 12.8119 9.5420 18.7315 10.9619 29.5551 34.6599 20.8207 6.6015 6.4014 8.3504 18.6209 29.0529 6.0408 3.1568 12.4437 4.1891 10.2703 5.4966 3.8872 12.0360 8.0737 9.1009 8.1168 3.8815 5.7882 7.7071 4.7752 1.2447 1.9290 1.4497 1.3355 1.3689 5.4888 6.5780 3.1965 3.9916 1.3680 1.8742 1.1208 4.1906 1.2506 5.5369 8.9790 5.5734 3.5652 3.7572 2.7670 10.1614 8.1610 7.6865 6.5337 1.0897 1.0896 1.0959 1.0931 1.0971
irintensity: 0.0007 0.1197 0.1183 0.0063 0.3441 0.4080 0.0680 0.8569 0.0492 0.0113 0.0918 0.6790 0.4753 0.6799 0.2061 0.0315 0.0806 0.0005 26.6155 5.7230 5.5030 2.6727 30.8706 26.7170 0.0221 0.3343 37.0244 7.0015 1.5993 67.6830 6.1500 0.0087 26.1250 15.0837 0.4965 0.0628 54.0613 23.8478 49.1268 7.9541 8.4096 39.2706 0.9791 32.3789 0.2878 56.6595 19.1333 0.3285 6.2935 144.8622 52.1753 21.9226 0.0529 1.0478 14.9741 3.6385 5.1179 4.9283 0.1885 0.2200
temp: 298.150 k
press: 1.00000 atm
elementType: 17 17 17 17 17 6 6 6 6 6 6 6 6 6 6 6 6 1 1 1 1 1
symmnumber: 1
zpe: 340033.4 jmol-1
zpe.correction: 0.129512 hartree
zpe.thermalcorrener: 0.144411 hartree
zpe.thermalcorrenthalpy: 0.145355 hartree
zpe.thermalcorrgfe: 0.085210 hartree
zpe.sumelectzpe: -2759.386121 hartree
zpe.sumelectthermal: -2759.371222 hartree
zpe.sumelectthermalent: -2759.370278 hartree
zpe.sumelectthermalfe: -2759.430423 hartree
dipole: 0.7648 -0.9528 0.0003
dipole: 1.2218
quadrupole: -145.6475 -135.3116 -124.3476
quadrupole: -1.2477 0.0005 0.0112
quadrupole: -10.5453 -0.2093 10.7546 -1.2477 0.0005 0.0112
hfenergy: -2759.5156332 hartree
pointgroup: C01 [X(C12H5Cl5)]
dipole: 0.3041165 -0.3722453 0.000126 debye
dipolederiv: -0.2392539 -0.2545447 0.0000789 -0.2942055 -0.5287243 0.0001449 0.0000413 0.0001265 -0.0080505 -0.2484839 0.2902578 -0.0000707 0.3398284 -0.4779852 0.0001242 -0.000083 0.0001062 0.0049628 -0.2296217 -0.2531938 0.0000787 -0.3335233 -0.6298171 0.0001905 0.0001286 0.0002044 -0.0196732 -0.7339711 -0.0535574 0.0000377 -0.0279822 -0.0086963 0.0000071 0.0000624 0.0000064 0.0111734 -0.9558063 0.019448 -0.0000182 0.0152712 -0.0634028 -0.0000601 -0.0000194 -0.0000562 -0.12173 0.4157741 -0.0877848 0.0000466 -0.107742 -0.0567928 -0.0000502 0.0000489 -0.0000176 -0.0412027 0.2505087 -0.0476868 -0.0000055 -0.0445199 -0.0726061 0.0000489 0.0000662 -0.0000188 -0.024318 0.0867945 0.4596636 -0.0001461 0.5384026 0.6295978 -0.000202 -0.0000998 -0.0001572 -0.045491 -0.2446415 -0.0855153 0.0000408 -0.0504935 -0.1824273 0.0000195 0.0000327 0.0000314 -0.0798235 -0.072971 0.0053488 0.0576326 -0.0065341 -0.0983827 -0.0178179 -0.1239403 0.0000852 0.0795846 -0.0730255 0.0052554 -0.0576366 -0.006066 -0.0983113 0.0181938 0.1239089 0.0002625 0.0795643 0.093916 -0.5014832 0.0001391 -0.5767702 0.592762 -0.0001394 0.000202 -0.0001481 -0.0024762 0.0943807 0.4150687 -0.0001282 0.4329335 0.941586 -0.0003058 -0.0002548 -0.0003376 -0.0321603 0.9654599 0.0542787 -0.0000579 0.0590733 -0.3048805 0.0000754 -0.0000787 0.0000852 -0.0417755 -0.3709248 0.0092629 -0.0897721 0.0160246 -0.0956284 0.0003031 -0.0698242 0.0006477 -0.0053962 -0.370861 0.0094242 0.0897722 0.016088 -0.0956181 -0.0001144 0.0697438 -0.0004323 -0.0053841 1.3949796 -0.0257358 0.0000277 -0.0245447 -0.0659526 0.0002009 0.0000632 0.0001862 0.1274918 0.0792231 0.038083 0.0000013 0.0611667 0.0325071 0.0000379 -0.0000039 0.000029 0.1430699 0.0492225 -0.0022412 -0.082988 -0.0033032 0.1318385 0.0055887 -0.0911581 0.0030187 -0.0130688 0.0492131 -0.0020613 0.0829711 -0.0031255 0.1318165 -0.0059136 0.0911609 -0.0032997 -0.0130443 0.0300422 0.0039209 0.0642926 0.00009 0.1595575 -0.0008418 0.0610795 -0.0020118 0.0038753 0.0300462 0.0037926 -0.0642959 -0.0000682 0.1595602 0.0005105 -0.0610761 0.0016898 0.0038722 unknown
polarizability: 272.3144638|7.8931921|162.0557713|-0.003121|0.014211|103.8583849 unknown
InChI: InChI=1S/C12H5Cl5/c13-7-3-1-6(2-4-7)8-5-9(14)11(16)12(17)10(8)15/h1-5H
charge 0 multiplicity 1
22 atoms
Cl -0.185768 2.667707 -0.000661
Cl -3.407452 2.568047 -0.000614
Cl -3.179927 -3.014439 0.000891
Cl -4.930807 -0.271423 0.000191
Cl 5.860856 -0.182997 0.000141
C  -0.275962 -0.11771 0.000014
C  1.224854 -0.110845 0.000041
C  -1.041915 1.075663 -0.000285
C  -0.965236 -1.353498 0.000295
C  1.942977 -0.124466 -1.22231
C  1.942963 -0.121914 1.222425
C  -2.457495 1.037739 -0.000264
C  -2.370899 -1.398574 0.000348
C  -3.132403 -0.208536 0.000071
C  3.355191 -0.146122 -1.230131
C  3.355177 -0.143558 1.230307
C  4.040969 -0.1551 0.000102
H  -0.394741 -2.286152 0.000556
H  1.400996 -0.113119 -2.173971
H  1.400976 -0.108592 2.174056
H  3.908787 -0.15502 -2.173481
H  3.908758 -0.150491 2.17368
