program: Gaussian 09
title: 000053034
version: EM64L-G09RevD.01
frameworkgroup: C1[X(C15H12N2O5)]
method: RPBEPBE
basis: SDD
operation: Freq
keyword: #p
keyword: freq=noraman
keyword: PBEPBE/SDD
title: #p freq=noraman PBEPBE/SDD
converged: NO YES NO NO
title: Mulliken charges:
elementType: O O O O O N N C C C C C C C C C C C C C C C H H H H H H H H H H H H
charge: -0.225353 -0.247269 -0.241954 -0.210883 -0.197466 -0.440558 0.049696 0.327285 0.490862 -0.318405 -0.358377 -0.471056 -0.354805 0.098351 0.390992 -0.259726 -0.296435 -0.348453 0.270354 -0.305141 0.219847 -0.797983 0.227408 0.281301 0.224838 0.313271 0.246830 0.290697 0.315639 0.276725 0.296143 0.242101 0.273198 0.238326
chargesum: 0.00000
title: Mulliken charges with hydrogens summed into heavy atoms:
elementType: O O O O O N N C C C C C C C C C C C C C C C
charge: -0.225353 -0.247269 -0.241954 -0.210883 -0.197466 -0.124919 0.049696 0.327285 0.490862 -0.090996 -0.077077 -0.246218 -0.041534 0.098351 0.390992 -0.012896 -0.005737 -0.071728 0.270354 -0.008998 0.219847 -0.044359
polarizability: 5.01089743e+02 -2.39757367e+00 2.32776127e+02 2.68043695e-01 1.29503429e-03 7.94388011e+01
1716.lowfreq: -64.9247 -3.9745 -2.0334 -0.0007 -0.0003 0.0003 2.6493 18.3734 24.0765
frequency: -64.9239 18.3233 23.9996 28.5572 53.2720 64.2776 73.4907 93.8054 99.0841 134.0389 149.6983 175.8175 182.3513 200.2649 223.1135 272.1493 313.7026 328.3517 345.1694 365.1654 409.3159 413.4207 439.7231 489.7065 508.5014 538.8595 562.4444 563.7593 580.6254 629.2196 630.7605 655.7236 660.7697 679.7399 692.3018 714.2547 741.9662 760.0587 815.3519 821.2374 826.7713 851.3745 884.5280 902.7269 907.9859 908.5142 924.4654 929.4179 952.9679 982.8788 993.9742 998.4917 1021.9320 1024.3688 1026.7515 1031.6766 1129.5152 1133.1868 1175.9664 1192.8983 1215.0031 1217.8751 1229.4657 1270.0301 1277.8915 1286.9142 1298.7991 1323.0579 1346.8385 1363.1255 1375.0354 1375.9894 1426.9537 1447.3708 1467.1781 1481.1856 1489.2799 1510.6563 1514.0044 1541.4368 1583.3119 1618.3468 1640.6121 1643.6192 2988.0354 3073.0110 3116.6125 3127.2590 3138.1294 3157.4581 3159.2572 3173.1080 3200.1467 3231.4520 3259.9058 3516.5566
redmass: 1.0504 5.1732 5.9713 8.4292 7.5421 6.0154 5.6748 7.1084 6.3443 4.6398 8.1346 6.4240 3.3340 6.2721 7.1362 6.2822 4.3319 7.8675 3.9670 4.1725 2.9220 9.6035 5.6302 7.4039 2.8074 4.7267 4.8227 5.4408 2.9460 7.0387 3.5656 6.8906 1.1815 8.3240 4.1123 7.5777 9.6593 3.5144 1.3389 4.5348 1.4557 4.9576 1.5331 1.7057 8.5018 1.5627 6.4793 6.6195 1.4102 1.7032 1.1252 3.6886 1.3363 2.5665 1.2572 1.6738 1.4431 3.4046 2.0612 1.2790 3.1326 3.0456 1.6928 1.9168 2.1359 6.4057 1.8381 1.6754 8.5885 4.2363 2.9820 1.3041 4.0574 1.1732 1.0469 8.1553 2.1360 3.1085 5.4437 5.7933 5.0765 5.5928 6.4523 5.4391 1.0385 1.0983 1.0898 1.0907 1.0979 1.0913 1.0935 1.0901 1.0951 1.0963 1.1032 1.0765
irintensity: 0.0468 5.8278 6.0503 2.6753 0.1788 0.0045 8.7419 0.0074 0.1689 2.1369 7.2483 0.0258 1.0572 1.5819 5.1018 6.7715 0.6996 0.0525 2.1446 7.1053 0.0019 3.8689 6.7554 3.1832 23.4616 12.2288 0.0936 0.7912 0.3692 0.3393 7.0954 59.4128 58.1419 14.8661 3.3360 7.6096 15.3464 1.2289 100.7442 3.6484 12.0816 2.7567 39.6811 13.7842 11.1045 1.1608 1.8068 7.7904 5.6152 64.7605 54.3943 41.6360 0.7024 42.3630 28.5889 8.5818 46.2498 34.4192 8.3170 439.2696 376.6880 184.2693 56.0447 59.1584 145.9535 80.6192 186.2267 56.0675 74.3703 333.1357 163.8281 139.7294 65.6238 58.1463 20.9388 381.2794 121.3370 125.6284 197.4464 101.2699 98.4529 353.2973 29.9362 114.1426 6.3657 13.2363 21.1985 0.7651 7.6261 4.5459 1.0491 10.8113 3.9684 0.5716 5.6686 15.8223
temp: 298.150 k
press: 1.00000 atm
elementType: 8 8 8 8 8 7 7 6 6 6 6 6 6 6 6 6 6 6 6 6 6 6 1 1 1 1 1 1 1 1 1 1 1 1
symmnumber: 1
zpe: 642021.9 jmol-1
zpe.correction: 0.244533 hartree
zpe.thermalcorrener: 0.263780 hartree
zpe.thermalcorrenthalpy: 0.264724 hartree
zpe.thermalcorrgfe: 0.193203 hartree
zpe.sumelectzpe: -1062.760409 hartree
zpe.sumelectthermal: -1062.741162 hartree
zpe.sumelectthermalent: -1062.740218 hartree
zpe.sumelectthermalfe: -1062.811740 hartree
dipole: 2.0904 -1.4514 -0.0431
dipole: 2.5452
quadrupole: -124.9226 -131.5244 -128.8355
quadrupole: -57.1211 0.0648 0.0802
quadrupole: 3.5049 -3.0969 -0.4080 -57.1211 0.0648 0.0802
hfenergy: -1063.0049422 hartree
pointgroup: C01 [X(C15H12N2O5)]
dipole: 0.8198678 -0.5699666 -0.0754749 debye
polarizability: 501.0050126|-4.2089686|230.699347|4.4095848|17.842052|81.600312 unknown
InChI: InChI=1S/C15H12N2O5/c1-10(18)16-12-4-2-11(3-5-12)14(19)8-6-13-7-9-15(22-13)17(20)21/h2-9,16H,1H3
charge 0 multiplicity 1
34 atoms
O  -3.716266 -0.280128 -0.108648
O  0.260423 2.926792 0.312693
O  6.824442 0.359296 0.088648
O  -6.809062 -2.070605 -0.3481
O  -4.631725 -2.816309 -0.412243
N  5.164811 -1.290585 -0.134616
N  -5.523259 -1.885263 -0.314302
C  1.482278 0.85904 0.085255
C  3.970749 -0.532782 -0.053765
C  1.515102 -0.553699 -0.091034
C  2.722349 1.549733 0.190637
C  2.73848 -1.237861 -0.159543
C  3.953893 0.881402 0.12476
C  0.223024 1.657815 0.164181
C  -3.579643 1.122828 0.051884
C  -1.091415 0.959521 0.067287
C  -2.257105 1.679136 0.132215
C  -4.859584 1.701663 0.101269
C  -5.088621 -0.526592 -0.153828
C  -5.821451 0.651554 -0.029586
C  6.498476 -0.850023 -0.065069
C  7.519627 -1.978804 -0.196715
H  0.59296 -1.13541 -0.178403
H  2.689324 2.635731 0.326288
H  2.742292 -2.326806 -0.296271
H  4.897878 1.421699 0.206591
H  -1.134089 -0.126499 -0.054869
H  -2.183443 2.767543 0.255316
H  5.036353 -2.297944 -0.263192
H  -5.064739 2.763782 0.219017
H  -6.905451 0.726211 -0.034725
H  7.430089 -2.698441 0.638327
H  8.528218 -1.542491 -0.177767
H  7.389584 -2.533604 -1.144392
