program: Gaussian 09
title: 000053033
version: EM64L-G09RevD.01
frameworkgroup: C1[X(C20H14O3)]
method: RPBEPBE
basis: SDD
operation: Freq
keyword: #pfreq=noraman
keyword: PBEPBE/SDD
title: #p freq=noraman PBEPBE/SDD
converged: YES YES NO NO
title: Mulliken charges:
elementType: O O O C C C C C C C C C C C C C C C C C C C C H H H H H H H H H H H H H H
charge: -0.289903 -0.430419 -0.413770 -0.357927 -0.393989 0.290926 0.478311 0.034486 0.037955 0.231857 0.499454 -0.339132 0.443223 0.461323 -0.457711 -0.792231 -0.226736 -0.504512 -0.485529 -0.383506 -0.455434 -0.248369 -0.190867 0.267768 0.232857 0.227147 0.245186 0.246229 0.184000 0.244437 0.238940 0.236719 0.242736 0.230390 0.229370 0.331880 0.334838
chargesum: 0.00000
title: Mulliken charges with hydrogens summed into heavy atoms:
elementType: O O O C C C C C C C C C C C C C C C C C C C C
charge: -0.289903 -0.098538 -0.078931 -0.090159 -0.161132 0.290926 0.478311 0.034486 0.037955 0.231857 0.499454 -0.111985 0.443223 0.461323 -0.212525 -0.546001 -0.042736 -0.260075 -0.246589 -0.146788 -0.212698 -0.017979 0.038503
polarizability: 3.87744847e+02 -6.67851258e+00 2.41167158e+02 3.96604428e+00 9.71670811e-01 1.08868986e+02
1716.lowfreq: 0.0002 0.0005 0.0005 4.8549 7.6037 10.7882 41.7831 58.5996 71.5941
frequency: 41.7459 58.5861 71.5847 126.1678 132.2731 161.6553 167.5565 208.5799 233.8415 240.5746 256.7544 287.4650 300.3307 326.1134 348.8924 365.2045 371.6518 395.2438 426.1240 454.1996 464.1064 502.5970 505.7981 511.0366 537.3442 556.3763 561.9643 584.1351 609.1125 630.9665 637.1043 651.1047 700.6755 715.3745 750.3874 751.7812 769.9109 778.2213 791.9741 809.3604 820.7006 840.4032 852.2371 866.8273 902.8501 917.8949 931.0912 947.6555 957.9516 968.8370 979.4287 987.3398 989.5961 993.7344 1037.4413 1040.2847 1055.3666 1082.5978 1109.9673 1129.4662 1163.8517 1167.8201 1173.5552 1176.2988 1199.4870 1202.4326 1230.9415 1239.6466 1253.1024 1285.9483 1290.7482 1294.7107 1312.4431 1335.3568 1354.9665 1363.9322 1375.0899 1401.8977 1410.1227 1418.3402 1431.4279 1440.4053 1446.9905 1472.4613 1496.4220 1522.7199 1588.7298 1600.1633 1621.7083 1625.6445 1661.8338 2906.2688 2933.6009 3102.1366 3118.3851 3121.4395 3123.1456 3124.8194 3132.1312 3132.6559 3147.0411 3159.7084 3162.0637 3511.2684 3517.5963
redmass: 5.7454 5.2193 5.0695 5.4398 5.8388 5.3486 5.7601 4.5143 5.1541 4.8791 1.1522 1.2015 4.0475 6.8589 4.3623 5.4409 5.2838 4.4478 4.6804 4.9312 5.6166 4.2301 6.0235 4.5596 4.1659 4.4313 4.7636 5.8148 5.8053 5.2489 5.6778 4.3828 4.3780 5.7043 3.7634 3.8324 1.6688 2.6093 4.0586 3.0468 3.3865 3.3796 1.8268 4.8243 2.7904 1.5127 1.8401 5.8980 3.3364 4.4498 1.3718 1.7866 2.2170 1.6043 2.3950 1.7169 1.5927 1.9687 2.0925 1.8297 1.2220 1.1558 1.1707 1.3798 1.2367 1.4573 1.5725 1.4881 1.5648 2.2909 1.2016 1.5967 2.2702 1.5587 1.7190 4.3544 1.9306 2.7105 5.7642 1.9567 4.4100 2.6330 5.0253 3.8335 4.0611 6.3367 7.9644 6.1941 7.0358 7.3357 7.2112 1.0830 1.0835 1.0893 1.0885 1.0884 1.0884 1.0864 1.0921 1.0919 1.0984 1.0991 1.0977 1.0657 1.0659
irintensity: 1.1586 0.7518 0.2362 1.3034 1.6316 4.4101 3.8786 0.8766 1.5100 6.3056 123.4246 170.6838 12.3198 18.0953 10.8198 9.6838 0.2248 7.6359 0.1062 1.5324 3.4436 1.2401 1.0892 4.0356 0.5393 5.1238 7.4668 2.2273 5.7968 19.2983 8.1800 4.5236 9.5958 3.4051 21.4799 10.7354 49.0606 11.0959 15.5775 4.4199 4.0676 12.3670 42.7495 14.0607 21.6111 1.1214 11.8197 122.1883 3.5731 55.5016 4.0291 1.0603 7.8367 3.5888 3.1030 15.1854 4.5742 2.6497 7.9584 33.3154 29.4805 25.2832 34.5054 8.7564 8.8620 10.4662 3.7068 1.3861 2.6184 0.7209 0.2493 0.4607 1.2748 4.7440 15.3216 3.4452 3.4487 3.4330 1.5417 3.5310 6.3876 2.2716 2.2645 1.7348 1.2367 2.6443 0.8633 2.0725 12.3817 2.3673 7.9339 95.6447 40.0234 20.5813 3.3495 7.0438 13.7517 0.9752 4.8443 30.4146 32.2526 42.2625 25.1724 5.8479 5.2565
temp: 298.150 k
press: 1.00000 atm
elementType: 8 8 8 6 6 6 6 6 6 6 6 6 6 6 6 6 6 6 6 6 6 6 6 1 1 1 1 1 1 1 1 1 1 1 1 1 1
symmnumber: 1
zpe: 741427.5 jmol-1
zpe.correction: 0.282395 hartree
zpe.thermalcorrener: 0.299591 hartree
zpe.thermalcorrenthalpy: 0.300536 hartree
zpe.thermalcorrgfe: 0.238372 hartree
zpe.sumelectzpe: -994.600453 hartree
zpe.sumelectthermal: -994.583257 hartree
zpe.sumelectthermalent: -994.582312 hartree
zpe.sumelectthermalfe: -994.644476 hartree
dipole: -0.4051 -0.4727 -2.0326
dipole: 2.1258
quadrupole: -105.5299 -111.8925 -145.4716
quadrupole: 9.4505 3.5336 4.2841
quadrupole: 15.4348 9.0722 -24.5070 9.4505 3.5336 4.2841
hfenergy: -994.8828482 hartree
pointgroup: C01 [X(C20H14O3)]
dipole: -0.1585057 0.1780584 0.8016473 debye
polarizability: 388.0040011|3.323329|240.8785606|-2.6804434|2.9800115|108.8984305 unknown
InChI: InChI=1S/C20H14O3/c21-13-7-6-11-8-10-5-4-9-2-1-3-12-14(9)15(10)17(16(11)18(13)22)20-19(12)23-20/h1-8,13,18-22H
charge 0 multiplicity 1
37 atoms
O  0.554833 2.575026 -1.077843
O  -2.895043 1.509227 1.720122
O  -4.393829 0.823594 -1.672969
C  -0.034134 1.962923 0.196904
C  1.411671 2.367784 0.173274
C  -0.389168 0.518398 0.116532
C  2.45823 1.318606 0.097814
C  0.666935 -0.451005 0.012697
C  2.067173 -0.057543 -0.003972
C  -1.736562 0.112801 0.157599
C  0.327621 -1.848021 -0.039984
C  -2.855213 1.133145 0.282387
C  -2.068708 -1.283224 0.122359
C  3.090516 -1.066782 -0.087602
C  3.819083 1.667848 0.138446
C  -1.039318 -2.234693 0.025708
C  -4.246217 0.639554 -0.207914
C  1.379798 -2.834799 -0.143748
C  2.709107 -2.458967 -0.170421
C  -3.475344 -1.703779 0.169424
C  4.464853 -0.678646 -0.070563
C  4.82713 0.669997 0.04681
C  -4.505361 -0.823527 0.04466
H  -0.744954 2.621371 0.706187
H  1.699264 3.318724 0.63897
H  -2.607599 2.033957 -0.322989
H  4.102834 2.723128 0.226574
H  -1.291895 -3.301767 -0.009261
H  -5.015163 1.255347 0.316647
H  1.098636 -3.893037 -0.194763
H  3.501091 -3.213299 -0.243665
H  -3.678082 -2.77565 0.286147
H  5.235859 -1.45472 -0.142314
H  5.883269 0.958694 0.065656
H  -5.547173 -1.159359 0.042299
H  -3.654849 2.133047 1.866693
H  -4.341492 1.793546 -1.882802
