program: Gaussian 09
title: 000053021
version: EM64L-G09RevD.01
frameworkgroup: C1[X(C11H15BrN2O)]
method: RPBEPBE
basis: SDD
operation: Freq
keyword: #p
keyword: freq=noraman
keyword: PBEPBE/SDD
title: #p freq=noraman PBEPBE/SDD
converged: YES YES NO NO
title: Mulliken charges:
elementType: Br O N N C C C C C C C C C C C H H H H H H H H H H H H H H H
charge: -0.007208 -0.239790 -0.395178 -0.369441 -0.035716 -0.513087 -0.704014 -0.700729 0.223176 0.471568 -0.411740 -0.327874 -0.154045 -0.166180 -0.235549 0.245234 0.234687 0.198516 0.241603 0.220006 0.193592 0.203522 0.215036 0.221268 0.317126 0.309056 0.230357 0.242972 0.247163 0.245669
chargesum: 0.00000
title: Mulliken charges with hydrogens summed into heavy atoms:
elementType: Br O N N C C C C C C C C C C C
charge: -0.007208 -0.239790 -0.078052 -0.060384 0.209518 -0.079884 -0.048813 -0.060903 0.223176 0.471568 -0.181384 -0.084901 0.093118 0.079488 -0.235549
polarizability: 2.23727147e+02 -1.38361298e+01 1.41114853e+02 1.20133883e+01 9.59555125e+00 9.81616460e+01
1716.lowfreq: -5.2061 -3.7573 -0.0004 -0.0003 0.0006 7.6378 18.7204 33.0419 39.1067
frequency: 18.6526 32.9896 39.0817 45.1454 78.3537 94.9220 148.5040 184.6298 208.9032 218.5053 235.4975 251.6724 278.1060 302.1962 313.7127 356.9991 382.8123 408.2484 413.6774 453.4409 491.9674 512.5376 542.6099 614.1526 622.5057 674.5252 697.5940 731.0146 807.3299 818.2835 824.3448 829.4258 877.7541 920.5342 924.0263 937.1030 952.8540 961.0182 966.0122 984.8202 1059.3520 1063.7740 1110.5686 1125.2138 1153.4478 1175.4607 1180.4969 1202.7208 1242.3663 1282.1267 1290.0242 1306.6830 1335.2626 1340.0194 1359.8721 1380.1809 1397.1579 1404.9919 1437.1059 1444.3065 1465.9208 1472.9184 1475.1732 1482.7404 1485.6253 1492.4131 1592.0185 1607.2280 1630.6785 2966.0060 2967.8172 2971.4261 3001.6257 3035.3823 3057.4035 3067.4516 3071.2420 3076.1893 3130.4893 3152.0763 3169.4698 3173.4552 3498.6085 3521.1876
redmass: 4.5740 3.7780 3.5642 4.7204 3.6261 6.5011 4.2678 5.3124 1.0619 4.8013 1.1290 3.5831 4.4808 3.1155 3.9204 2.5547 2.6439 2.9562 2.2368 2.2112 2.4094 2.8310 1.6763 3.0554 6.3467 4.8181 3.3633 4.5835 1.3484 1.8317 2.4076 3.4116 1.5671 1.5494 2.0859 1.3387 1.3515 1.5287 2.2863 4.6056 2.4654 1.8220 1.4211 2.0904 2.6836 1.8788 1.1064 1.9573 1.5363 1.5513 1.2917 2.5750 1.5557 1.4067 3.9932 1.2141 1.2193 4.2801 1.5423 1.1340 1.0505 1.0529 2.4453 1.0565 1.0464 1.4514 5.2525 6.5326 6.7046 1.0362 1.0460 1.0514 1.0829 1.1007 1.0991 1.0984 1.0998 1.0987 1.0896 1.0876 1.0953 1.0968 1.0766 1.0788
irintensity: 0.1284 2.2124 0.2387 2.9022 1.3069 2.6759 5.2712 1.7802 0.3931 3.4755 0.2125 14.6753 2.2340 1.8336 0.9437 3.0889 2.3355 0.2386 1.8147 78.3630 24.5859 29.9956 188.0598 12.5026 3.4802 9.6360 0.4283 1.2328 9.4426 57.5107 4.3206 42.7397 4.1741 5.0925 6.8133 0.2726 0.3440 0.1139 2.9660 32.1099 42.3241 8.9122 6.2409 16.9754 22.3727 37.5269 18.8758 44.7135 33.7481 34.6435 3.2362 8.5214 14.3365 10.8008 16.8743 15.9411 9.8434 0.0851 119.9982 25.0168 3.6154 5.0741 186.3782 8.7546 22.6596 50.0112 6.9653 78.8146 115.7942 37.7232 15.7332 31.4617 2.2667 12.9931 14.4591 74.1772 18.9401 69.2313 11.3173 6.3336 12.0326 1.4078 23.2783 34.0233
temp: 298.150 k
press: 1.00000 atm
elementType: 35 8 7 7 6 6 6 6 6 6 6 6 6 6 6 1 1 1 1 1 1 1 1 1 1 1 1 1 1 1
symmnumber: 1
zpe: 634093.4 jmol-1
zpe.correction: 0.241513 hartree
zpe.thermalcorrener: 0.257727 hartree
zpe.thermalcorrenthalpy: 0.258671 hartree
zpe.thermalcorrgfe: 0.194628 hartree
zpe.sumelectzpe: -625.212718 hartree
zpe.sumelectthermal: -625.196505 hartree
zpe.sumelectthermalent: -625.195561 hartree
zpe.sumelectthermalfe: -625.259603 hartree
dipole: -3.7171 0.9667 -2.9124
dipole: 4.8201
quadrupole: -97.6714 -91.1820 -103.6298
quadrupole: 4.1003 10.6198 0.1813
quadrupole: -0.1770 6.3124 -6.1354 4.1003 10.6198 0.1813
hfenergy: -625.4542315 hartree
pointgroup: C01 [X(C11H15Br1N2O1)]
dipole: -1.2998874 -0.4203548 1.3152052 debye
polarizability: 214.4560237|23.6672523|148.7508423|-25.0155824|-2.1427875|99.7967802 unknown
InChI: InChI=1S/C11H15BrN2O/c1-8(2)7-11(15)14-13-10-5-3-9(12)4-6-10/h3-6,8,13-14H,7H2,1-2H3
charge 0 multiplicity 1
30 atoms
Br 5.078945 1.951646 -0.780673
O  -1.783947 -1.387607 -1.127203
N  -0.972402 -1.155366 1.038724
N  0.286298 -1.69317 0.733746
C  -3.834399 0.681791 -0.278588
C  -3.30815 -0.494373 0.593576
C  -2.896674 1.908313 -0.190293
C  -5.277531 1.047372 0.134466
C  -1.979812 -1.038711 0.071576
C  1.344962 -0.826418 0.350202
C  2.524738 -1.396302 -0.20038
C  1.28329 0.574972 0.56122
C  3.623035 -0.580694 -0.537415
C  2.384141 1.39373 0.228348
C  3.544998 0.810694 -0.316307
H  -3.839558 0.322646 -1.32641
H  -4.043934 -1.322028 0.562751
H  -3.221658 -0.167698 1.649913
H  -1.873173 1.660194 -0.526511
H  -3.267917 2.728953 -0.830718
H  -2.842405 2.290628 0.848232
H  -5.314927 1.395337 1.185236
H  -5.95875 0.181222 0.03749
H  -5.672193 1.860946 -0.501264
H  -1.170566 -0.984949 2.027333
H  0.232773 -2.588517 0.237807
H  2.586183 -2.478049 -0.368081
H  0.375288 1.02755 0.970578
H  4.525148 -1.026243 -0.966272
H  2.329195 2.474332 0.389516
