program: Gaussian 09
title: 000053050
version: EM64L-G09RevD.01
frameworkgroup: C1[X(C16H16N2O)]
method: RPBEPBE
basis: SDD
operation: Freq
keyword: #p
keyword: freq=noraman
keyword: PBEPBE/SDD
title: #p freq=noraman PBEPBE/SDD
converged: YES YES NO NO
title: Mulliken charges:
elementType: O N N C C C C C C C C C C C C C C C C H H H H H H H H H H H H H H H H
charge: -0.289331 -0.203613 -0.398452 -0.211683 -0.429369 0.500710 -0.571124 0.225543 0.476085 -0.376720 -0.446630 -0.405435 -0.370515 -0.232244 -0.225148 -0.240879 -0.231809 -0.233074 -0.240569 0.261669 0.232708 0.240194 0.232716 0.254434 0.319573 0.255386 0.235177 0.233873 0.269067 0.229074 0.229080 0.231433 0.225406 0.226971 0.227495
chargesum: 0.00000
title: Mulliken charges with hydrogens summed into heavy atoms:
elementType: O N N C C C C C C C C C C C C C C C C
charge: -0.289331 -0.203613 -0.078879 0.049987 0.043533 0.500710 -0.083974 0.225543 0.476085 -0.121333 -0.211452 -0.171562 -0.101448 -0.003171 0.003932 -0.009446 -0.006403 -0.006103 -0.013074
polarizability: 2.01091318e+02 -1.89049084e+01 1.95512806e+02 -2.17108865e+01 -1.43075186e+01 1.30520189e+02
1716.lowfreq: -5.7668 -0.0010 0.0004 0.0004 7.3140 13.4207 24.5949 30.9265 35.3585
frequency: 23.5980 30.8083 35.3408 54.7534 65.8773 86.4959 157.4403 188.0903 194.4585 220.3782 272.4640 311.0744 324.9509 367.0659 403.5596 405.1057 453.0338 463.5257 488.9339 544.7687 584.5419 606.4044 616.4212 616.8985 650.3731 689.4387 701.9612 707.4911 713.4900 742.5122 770.4815 776.7951 811.1648 851.9144 859.1486 862.6180 920.3260 926.6324 936.7700 978.1878 982.3943 984.1570 989.3286 991.0046 999.3243 1000.1577 1021.8712 1026.7515 1027.0298 1058.7904 1077.2264 1086.3580 1112.1627 1171.9999 1172.8877 1179.2679 1184.3966 1189.2065 1191.2820 1208.0659 1220.4763 1248.4697 1279.7502 1292.4901 1307.5883 1332.0903 1350.5177 1352.6464 1369.4821 1384.5585 1388.3938 1403.4770 1442.0572 1447.5909 1461.8308 1483.6221 1484.6842 1498.3488 1593.2763 1596.4333 1612.6999 1615.2255 1667.8427 2940.9733 2968.7330 3005.8699 3057.8612 3064.7457 3113.3304 3115.2991 3122.1528 3122.6928 3132.7383 3134.9323 3144.1396 3146.5366 3161.0632 3164.0205 3613.6888
redmass: 4.5203 4.5060 3.8258 4.5242 5.9442 4.5258 5.1776 4.4812 3.6711 4.2346 4.6974 5.8904 4.1147 2.1438 2.8281 2.8393 2.7153 1.3092 4.1031 3.2352 4.6008 5.2771 6.3561 6.2467 3.9524 5.4669 4.0038 1.8673 2.1839 2.8035 1.9058 2.8715 3.4357 3.9039 1.2566 1.2456 1.7393 1.4496 1.6785 2.0622 1.3851 1.3886 6.2370 5.5250 1.3227 1.3343 2.4549 2.2455 2.1117 2.1147 2.0810 1.5791 2.0030 1.0557 1.0580 1.7192 1.1190 1.1342 1.8742 2.7746 2.2088 2.4638 1.4185 1.3487 1.4714 1.2940 1.4287 1.4116 2.2706 3.4740 4.6457 2.4898 2.1355 2.0914 1.1458 2.1142 2.3476 1.0984 6.0262 6.0733 5.9660 6.1319 8.1018 1.0840 1.0657 1.0600 1.0989 1.1030 1.0870 1.0877 1.0867 1.0864 1.0918 1.0907 1.0962 1.0959 1.1015 1.1014 1.0794
irintensity: 0.1974 0.1386 0.0785 1.6916 4.0447 0.4622 4.0109 1.1122 6.0813 2.7123 7.5503 1.8119 8.6832 10.3292 0.0281 0.0391 23.5091 110.6232 25.7055 3.0195 10.5997 16.3526 0.5835 0.2629 13.9471 18.4896 26.7202 56.3317 69.4675 1.3500 59.8615 6.6813 10.9021 2.2586 0.1472 0.9005 5.3956 2.9978 14.1669 3.2852 0.1224 0.2862 0.0921 0.8881 1.7234 0.5830 0.5396 7.7823 5.0389 12.6333 61.9243 7.4373 3.7669 0.1070 0.2416 3.5806 1.7497 3.2781 30.7799 24.6055 22.5174 144.0584 6.5229 20.7807 8.1153 7.7032 23.6912 8.0338 45.7548 5.2944 22.5777 103.9456 5.4973 12.2302 35.9364 14.1682 11.6102 18.4013 2.0535 1.0234 3.3968 2.2868 416.6906 24.1033 67.8251 28.7560 29.2555 4.7024 12.3120 5.4891 0.2082 1.2770 12.9776 8.1168 30.0178 33.2557 28.4319 24.7580 47.8652
temp: 298.150 k
press: 1.00000 atm
elementType: 8 7 7 6 6 6 6 6 6 6 6 6 6 6 6 6 6 6 6 1 1 1 1 1 1 1 1 1 1 1 1 1 1 1 1
symmnumber: 1
zpe: 747135.4 jmol-1
zpe.correction: 0.284569 hartree
zpe.thermalcorrener: 0.300536 hartree
zpe.thermalcorrenthalpy: 0.301480 hartree
zpe.thermalcorrgfe: 0.238612 hartree
zpe.sumelectzpe: -802.703806 hartree
zpe.sumelectthermal: -802.687839 hartree
zpe.sumelectthermalent: -802.686895 hartree
zpe.sumelectthermalfe: -802.749763 hartree
dipole: 3.1427 -2.2269 2.5426
dipole: 4.6152
quadrupole: -106.0610 -109.3945 -109.3980
quadrupole: 6.3395 -6.6671 5.7380
quadrupole: 2.2235 -1.1100 -1.1135 6.3395 -6.6671 5.7380
hfenergy: -802.9883747 hartree
pointgroup: C01 [X(C16H16N2O1)]
dipole: -1.1841593 -0.9326969 -1.0123362 debye
polarizability: 198.6238944|19.5300109|197.3727925|-22.4400619|14.0274959|131.1276258 unknown
InChI: InChI=1S/C16H16N2O/c19-16-17-11-15(14-9-5-2-6-10-14)18(16)12-13-7-3-1-4-8-13/h1-10,15,17H,11-12H2
charge 0 multiplicity 1
35 atoms
O  1.235455 3.280495 0.910494
N  0.046424 1.272344 0.411059
N  -0.228463 3.04031 -0.956212
C  -0.715491 0.732516 -0.740467
C  -1.205365 2.051977 -1.439242
C  -1.849916 -0.203688 -0.34247
C  0.786893 0.40634 1.343309
C  0.436038 2.609024 0.198167
C  1.902415 -0.393864 0.669553
C  -2.727597 0.134537 0.719147
C  -2.054073 -1.416336 -1.043437
C  1.773787 -1.788755 0.457227
C  3.081154 0.26423 0.228851
C  -3.795283 -0.720918 1.065458
C  -3.127605 -2.271986 -0.704033
C  -4.001724 -1.925859 0.351419
C  2.803799 -2.518734 -0.181442
C  4.109637 -0.462306 -0.409854
C  3.974607 -1.856685 -0.616309
H  -0.027823 0.188947 -1.424172
H  -1.192387 1.950086 -2.537541
H  -2.23822 2.294455 -1.116567
H  0.069805 -0.273922 1.838274
H  1.206163 1.084907 2.108261
H  -0.245411 4.028233 -1.198903
H  -2.556119 1.061856 1.279291
H  -1.367943 -1.69299 -1.854227
H  0.866181 -2.304786 0.796491
H  3.183126 1.343846 0.394134
H  -4.464814 -0.453202 1.890669
H  -3.276902 -3.20658 -1.256222
H  -4.83124 -2.589705 0.619503
H  2.694441 -3.598337 -0.335968
H  5.018012 0.054421 -0.740016
H  4.775539 -2.42037 -1.108228
