program: Gaussian 09
title: 000053018
version: EM64L-G09RevD.01
frameworkgroup: C1[X(C12H9BrN4O2)]
method: RPBEPBE
basis: SDD
operation: Freq
keyword: #p
keyword: freq=noraman
keyword: PBEPBE/SDD
title: #p freq=noraman PBEPBE/SDD
converged: YES YES NO NO
title: Mulliken charges:
elementType: Br O O N N N N C C C C C C C C C C C C H H H H H H H H H
charge: -0.031186 -0.219070 -0.218252 -0.420239 0.044145 0.020433 0.003181 0.506882 0.387732 -0.395424 -0.332389 -0.339566 -0.336736 0.488632 -0.365905 -0.274990 -0.422737 -0.175433 -0.327552 0.239221 0.268231 0.288752 0.287400 0.305229 0.268664 0.260447 0.239060 0.251471
chargesum: 0.00000
title: Mulliken charges with hydrogens summed into heavy atoms:
elementType: Br O O N N N N C C C C C C C C C C C C
charge: -0.031186 -0.219070 -0.218252 -0.115010 0.044145 0.020433 0.003181 0.506882 0.387732 -0.156203 -0.064159 -0.050813 -0.049337 0.488632 -0.365905 -0.006327 -0.162290 0.063626 -0.076081
polarizability: 4.44962956e+02 -1.39432078e+01 2.19295705e+02 3.22647041e-01 1.16994526e-01 6.52486186e+01
1716.lowfreq: 0.0002 0.0004 0.0005 4.0428 7.3934 9.0702 26.0782 35.1299 40.2980
frequency: 25.9531 35.0497 40.2077 42.7612 77.2163 102.5609 128.9408 136.4564 153.2492 210.1914 256.3470 266.8813 280.2047 310.8991 383.0536 391.8820 417.8131 441.7648 447.3156 498.5958 512.3772 558.4325 563.6581 609.7041 624.8020 643.3136 656.6350 664.6764 673.7815 711.4352 733.3060 772.6609 818.9297 827.6851 829.8287 858.4678 894.3031 918.9981 950.5396 981.7656 994.1433 994.7971 997.2435 998.1148 1028.4203 1084.7728 1096.8990 1114.2904 1129.8766 1171.7280 1202.4009 1222.5895 1247.7846 1287.1296 1307.6593 1312.5444 1338.0562 1353.6675 1398.6284 1406.2389 1437.8862 1455.9013 1480.2459 1513.8998 1537.0572 1570.4940 1593.1245 1609.9799 1619.0530 3135.8675 3139.3875 3153.7380 3159.6182 3174.6826 3178.9001 3185.2790 3192.6760 3384.4076
redmass: 4.5716 6.6918 10.3023 8.4626 6.3295 6.7716 13.5103 10.4922 5.5785 10.0861 6.5410 5.1576 7.3437 4.8564 3.0749 8.5946 3.0000 7.7433 4.7281 2.9919 7.0420 5.4989 8.1376 8.2068 7.1968 1.3145 7.8604 4.6900 7.9059 1.9464 4.6987 8.6211 1.5955 6.4038 1.2960 1.6171 6.7116 1.4124 1.4803 1.3360 2.9350 1.3637 1.3567 3.9643 3.2312 3.2889 2.9642 1.3521 1.6734 1.3652 1.3845 5.1735 3.2756 1.3858 3.9551 2.7737 1.2781 8.0909 4.3908 2.2399 4.6756 2.0979 2.0199 2.6482 5.1416 5.9716 7.1748 8.6549 7.1498 1.0909 1.0883 1.0913 1.0926 1.0886 1.0994 1.0947 1.0969 1.0754
irintensity: 3.2656 0.6023 0.7720 2.5259 0.1517 1.8561 0.1921 3.6305 0.2740 1.7396 13.7388 1.3651 5.6591 3.4485 0.5500 5.2839 0.3428 7.5776 5.5667 21.1617 6.7631 3.3458 3.2786 5.7902 5.4736 72.5242 57.8373 25.0591 1.8529 33.9329 4.5687 20.0582 37.7989 39.5360 12.0634 76.9647 118.3902 3.4935 2.4223 1.2795 1.7623 0.6194 0.1851 36.7100 30.7287 141.7639 54.3094 19.9333 51.0865 231.8487 3.4960 738.1107 69.1844 33.0295 39.3722 85.9055 12.8478 64.1517 111.7429 22.9926 20.3126 22.6181 4.4691 236.9252 26.3103 0.0005 88.7480 276.6960 311.2815 7.8860 6.2639 9.8575 10.9679 0.6998 13.0419 1.2641 3.7476 52.2112
temp: 298.150 k
press: 1.00000 atm
elementType: 35 8 8 7 7 7 7 6 6 6 6 6 6 6 6 6 6 6 6 1 1 1 1 1 1 1 1 1
symmnumber: 1
zpe: 512371.5 jmol-1
zpe.correction: 0.195152 hartree
zpe.thermalcorrener: 0.211588 hartree
zpe.thermalcorrenthalpy: 0.212532 hartree
zpe.thermalcorrgfe: 0.147561 hartree
zpe.sumelectzpe: -844.150801 hartree
zpe.sumelectthermal: -844.134365 hartree
zpe.sumelectthermalent: -844.133420 hartree
zpe.sumelectthermalfe: -844.198392 hartree
dipole: -3.9925 -0.4928 0.0421
dipole: 4.0230
quadrupole: -182.8292 -102.2657 -122.2727
quadrupole: -16.7102 -0.1276 0.1212
quadrupole: -47.0400 33.5235 13.5165 -16.7102 -0.1276 0.1212
hfenergy: -844.345953 hartree
pointgroup: C01 [X(C12H9Br1N4O2)]
dipole: -1.5395898 -0.3668378 -0.0145831 debye
polarizability: 445.2369864|11.121518|218.4789576|3.4794103|8.9432846|65.7913357 unknown
InChI: InChI=1S/C12H9BrN4O2/c13-12(9-2-1-7-14-8-9)16-15-10-3-5-11(6-4-10)17(18)19/h1-8,15H
charge 0 multiplicity 1
28 atoms
Br -2.564267 -3.003445 -0.154653
O  6.315597 -0.033338 0.073245
O  5.474253 2.088525 0.1788
N  0.06325 -1.317371 -0.043701
N  -1.043453 -0.530616 -0.008244
N  5.328511 0.803865 0.109738
N  -5.881991 0.177062 -0.019521
C  1.351425 -0.765284 -0.004892
C  3.959659 0.262798 0.070266
C  2.466978 -1.649793 -0.042692
C  1.55587 0.640932 0.070672
C  3.771468 -1.137323 -0.005181
C  2.86063 1.153205 0.108177
C  -3.443037 -0.125643 -0.000414
C  -2.257741 -0.993148 -0.042564
C  -3.271319 1.288323 0.101087
C  -4.77721 -0.62024 -0.057226
C  -4.405643 2.117052 0.140521
C  -5.691029 1.524679 0.078508
H  2.308328 -2.732976 -0.100681
H  0.689985 1.305895 0.098381
H  4.644618 -1.794044 -0.03263
H  3.04916 2.228396 0.16598
H  -0.061784 -2.339735 -0.10011
H  -2.261163 1.704415 0.146423
H  -4.970425 -1.69459 -0.136066
H  -4.303282 3.203727 0.21827
H  -6.599089 2.136876 0.107307
