program: Gaussian 09
title: 000053049
version: EM64L-G09RevD.01
frameworkgroup: C1[X(C16H15NO3S)]
method: RPBEPBE
basis: SDD
operation: Freq
keyword: #p
keyword: freq=noraman
keyword: PBEPBE/SDD
title: #p freq=noraman PBEPBE/SDD
converged: YES YES NO NO
title: Mulliken charges:
elementType: S O O O N C C C C C C C C C C C C C C C C H H H H H H H H H H H H H H H
charge: 0.244193 -0.233984 -0.255157 -0.215815 0.009607 0.395278 0.198822 0.221185 -0.565262 -0.516313 0.193024 0.013731 -0.518427 0.198401 -0.315097 0.288462 -0.687457 -0.724410 -0.145413 -0.535509 -0.731457 0.288288 0.215832 0.225110 0.270661 0.275290 0.236711 0.217688 0.221407 0.282376 0.250015 0.226094 0.227500 0.244089 0.263074 0.237465
chargesum: 0.00000
title: Mulliken charges with hydrogens summed into heavy atoms:
elementType: S O O O N C C C C C C C C C C C C C C C C
charge: 0.244193 -0.233984 -0.255157 -0.215815 0.009607 0.395278 0.198822 0.221185 -0.276974 -0.075372 0.193024 0.013731 -0.247765 0.198401 -0.039807 0.288462 -0.011652 -0.442034 -0.145413 0.168099 0.013171
polarizability: 3.45317606e+02 1.11243900e+01 1.92736003e+02 8.69216683e+00 -1.12711441e+01 1.27188771e+02
1716.lowfreq: -8.2486 -0.0010 -0.0006 0.0011 1.7665 6.8158 29.3973 31.8048 49.2447
frequency: 29.3876 31.7304 49.2417 65.3117 69.4621 79.4217 95.4368 132.8285 148.0577 163.0267 191.8064 200.3650 214.0213 228.0249 239.0344 261.2211 273.5083 284.0988 308.5010 322.2448 367.9457 407.1210 430.8348 460.9351 488.0620 490.5491 504.2278 520.5503 528.6601 549.8038 560.9939 592.2489 640.4516 661.4041 700.7007 720.0201 739.7329 756.6624 776.0116 791.1145 793.7617 805.2596 836.9063 847.2319 882.3466 902.9485 943.7929 947.5728 967.8333 989.2239 1036.5932 1052.0153 1057.0116 1060.7541 1075.9800 1112.9842 1128.8042 1154.1143 1156.4287 1170.3834 1183.0479 1232.2987 1249.0765 1265.6257 1271.5363 1303.5402 1315.4050 1341.3136 1384.4576 1393.1246 1403.2030 1427.3069 1444.4994 1455.7602 1458.4795 1466.3840 1467.6460 1470.7472 1475.1256 1486.6117 1490.3126 1504.3496 1544.6912 1553.5942 1568.0462 1618.1451 1628.8623 2966.9490 2984.6342 2991.0963 2998.9595 3052.6846 3058.6349 3072.0955 3081.0750 3094.6667 3116.1430 3131.3629 3146.7573 3181.2659 3187.9172 3240.1692
redmass: 6.2327 4.5537 4.7834 2.9060 4.4852 1.1149 3.7599 5.5791 4.8791 4.2655 1.6825 2.2180 2.2514 3.1723 2.6042 2.6090 2.8333 4.7060 2.9150 4.8389 4.1342 7.1078 4.7045 5.5802 4.9257 3.7958 4.9462 7.1240 5.9574 6.0232 5.6891 5.5512 8.2830 6.0462 5.6496 5.2453 3.1403 3.7261 1.6980 1.3079 3.9720 3.8949 5.4955 1.7950 1.4464 5.3354 1.4267 3.1219 2.6693 3.5557 1.4118 2.5925 2.4624 2.2013 1.8806 1.2610 3.0805 1.5341 1.7727 1.8946 3.4909 1.3392 3.0044 2.2943 1.9098 3.8409 1.4840 1.9105 1.2333 1.2349 6.4307 2.0058 1.9122 1.0941 1.0545 1.2488 1.0511 1.1074 1.0506 1.6318 1.3230 7.9779 6.7839 11.3993 9.2787 8.4011 7.5704 1.0326 1.0349 1.0368 1.0596 1.1020 1.1043 1.0981 1.1000 1.1014 1.0989 1.1001 1.0918 1.0914 1.0953 1.0960
irintensity: 2.0397 0.0271 1.1461 0.3808 0.8648 0.0785 2.6967 1.5765 5.1913 0.2973 1.7784 0.7974 0.7609 1.9876 0.6082 7.2765 0.5214 1.8823 2.2436 2.9519 1.9867 5.8599 2.7176 9.7891 3.1786 1.3249 3.1966 2.2516 30.2410 19.0947 5.1214 3.9641 3.9245 11.4173 10.9302 10.1574 5.3229 10.4660 27.4760 7.0807 16.5080 25.5743 14.5794 36.0518 25.2142 15.9961 14.6622 2.2737 4.8192 40.4440 2.1896 55.3405 11.1480 30.3173 5.4974 0.0978 128.0952 6.8454 21.8395 142.8866 107.0848 40.4388 21.4373 93.5096 47.5636 55.0471 3.1627 24.1578 9.7799 15.2598 49.3883 0.6072 69.0115 25.5059 20.3856 88.6819 13.3754 42.5101 11.9889 48.5758 70.6734 16.5155 68.1628 119.4434 19.4515 114.1066 167.5620 62.5331 44.9277 17.5609 27.8057 3.8714 38.7601 12.3967 52.2017 31.5699 4.7722 21.0763 4.8413 1.7369 5.4362 3.1460
temp: 298.150 k
press: 1.00000 atm
elementType: 16 8 8 8 7 6 6 6 6 6 6 6 6 6 6 6 6 6 6 6 6 1 1 1 1 1 1 1 1 1 1 1 1 1 1 1
symmnumber: 1
zpe: 715990.8 jmol-1
zpe.correction: 0.272706 hartree
zpe.thermalcorrener: 0.292735 hartree
zpe.thermalcorrenthalpy: 0.293679 hartree
zpe.thermalcorrgfe: 0.222875 hartree
zpe.sumelectzpe: -1295.659478 hartree
zpe.sumelectthermal: -1295.639450 hartree
zpe.sumelectthermalent: -1295.638506 hartree
zpe.sumelectthermalfe: -1295.709309 hartree
dipole: -2.5208 -4.1244 -0.2222
dipole: 4.8388
quadrupole: -99.4788 -123.5707 -130.3145
quadrupole: 7.0988 -1.2691 -2.1730
quadrupole: 18.3092 -5.7827 -12.5265 7.0988 -1.2691 -2.1730
hfenergy: -1295.9321849 hartree
pointgroup: C01 [X(C16H15N1O3S1)]
dipole: -1.0285779 -1.5532796 -0.391851 debye
polarizability: 344.9476742|4.8658179|194.1794293|16.9421861|0.1566593|126.1152767 unknown
InChI: InChI=1S/C16H15NO3S/c1-4-10-5-11-15(6-14(10)19-3)20-7-12(16(11)18)13-8-21-9(2)17-13/h5-8H,4H2,1-3H3
charge 0 multiplicity 1
36 atoms
S  5.59258 -0.632873 0.921417
O  -0.268894 -1.973456 -0.460995
O  -4.84276 -0.319067 -0.624739
O  1.152287 1.838904 0.551891
N  3.7877 0.597877 -0.617879
C  -3.062448 1.198716 -0.116291
C  -0.715099 0.41154 -0.02642
C  -1.169343 -0.89174 -0.339025
C  -1.694953 1.437172 0.078206
C  -4.09573 2.302744 0.024586
C  -3.468396 -0.144314 -0.433725
C  0.725616 0.69403 0.198415
C  -2.530043 -1.191324 -0.545519
C  1.617499 -0.482413 0.007397
C  1.086653 -1.712295 -0.299955
C  3.082835 -0.342335 0.162326
C  -4.8474 2.246648 1.382374
C  3.865935 -1.0895 1.032011
C  5.081035 0.603236 -0.373784
C  -5.321923 -1.65713 -0.988321
C  6.10276 1.482234 -1.029537
H  -1.336209 2.443692 0.320221
H  -3.591965 3.281755 -0.075183
H  -4.836692 2.225067 -0.79227
H  -2.81262 -2.218447 -0.78643
H  1.678766 -2.615738 -0.462637
H  -5.38924 1.290882 1.487754
H  -5.583208 3.068516 1.451413
H  -4.143081 2.342893 2.228168
H  3.540673 -1.833524 1.755984
H  -6.41022 -1.5504 -1.102406
H  -5.098535 -2.390732 -0.190303
H  -4.875354 -1.994226 -1.943201
H  6.607518 2.132267 -0.29208
H  5.594535 2.1208 -1.769389
H  6.881421 0.890241 -1.543672
