program: Gaussian 09
title: 000053020
version: EM64L-G09RevD.01
frameworkgroup: C1[X(C10H13BrN2O)]
method: RPBEPBE
basis: SDD
operation: Freq
keyword: #p
keyword: freq=noraman
keyword: PBEPBE/SDD
title: #p freq=noraman PBEPBE/SDD
converged: YES YES NO NO
title: Mulliken charges:
elementType: Br O N N C C C C C C C C C C H H H H H H H H H H H H H
charge: -0.007059 -0.243247 -0.395757 -0.368832 -0.489710 -0.348110 0.236441 -0.679657 0.469122 -0.409862 -0.332254 -0.154232 -0.162128 -0.234724 0.236060 0.201205 0.203143 0.242717 0.212358 0.206795 0.225024 0.316575 0.309851 0.230901 0.243341 0.247143 0.244897
chargesum: 0.00000
title: Mulliken charges with hydrogens summed into heavy atoms:
elementType: Br O N N C C C C C C C C C C
charge: -0.007059 -0.243247 -0.079183 -0.058981 -0.052445 0.097751 0.236441 -0.035480 0.469122 -0.178962 -0.088913 0.092911 0.082768 -0.234724
polarizability: 2.23055246e+02 -6.95178002e+00 1.22702282e+02 1.04570039e+01 9.15096595e+00 8.79559074e+01
1716.lowfreq: -17.1269 -7.3955 0.0006 0.0008 0.0008 1.7945 9.4110 32.9144 40.2228
frequency: -6.0672 32.9083 40.1924 50.3081 80.4430 95.3196 150.1290 200.0862 225.4726 234.2243 251.0984 279.4928 308.1566 316.1268 368.1468 407.1948 452.9182 511.7352 522.2314 528.2063 609.5995 625.3478 659.7726 697.2269 728.6609 748.9681 806.4472 818.4636 828.8914 865.1027 891.7404 936.4712 940.1547 951.8722 984.6094 1054.5783 1057.4408 1059.8812 1100.3565 1110.0174 1149.5121 1179.5562 1207.5458 1235.2096 1277.6875 1286.0166 1292.3186 1317.6097 1348.7504 1359.7552 1392.7126 1403.7488 1437.3687 1447.3846 1474.1125 1475.6023 1478.9628 1485.7539 1491.2710 1591.4561 1606.8918 1631.0069 2974.5370 2976.1429 2993.0783 3028.4267 3051.5192 3078.3176 3078.4896 3131.4141 3152.6609 3168.9149 3173.8739 3496.3363 3523.1635
redmass: 3.7154 5.9674 4.5184 2.3794 2.8220 5.3851 4.6888 5.0073 4.6361 1.1514 3.5254 4.0982 4.5413 3.6087 3.2134 2.9465 2.2477 2.6288 2.3731 2.0785 2.6639 5.3482 4.5046 3.2742 2.5893 1.4801 1.3335 1.6903 3.4296 1.3393 2.0378 1.3558 4.4334 1.3571 4.5907 1.8344 2.8039 2.3400 2.0928 1.4142 2.5291 1.1066 2.0483 1.4475 1.2533 1.3898 1.7364 1.6945 1.5565 3.9203 1.2132 4.3717 1.5946 1.1012 2.4118 1.0615 1.0446 1.0812 1.4430 5.3171 6.5390 6.7281 1.0416 1.0535 1.0638 1.0974 1.1005 1.1020 1.0990 1.0894 1.0876 1.0955 1.0969 1.0763 1.0789
irintensity: 0.5221 2.8320 1.8374 1.1141 1.2508 0.9375 4.3435 6.5149 1.7166 0.7990 17.8905 3.1806 0.6476 2.7785 3.4302 0.2994 76.1614 10.3867 141.9198 75.6835 33.6973 2.4826 14.0655 0.1552 3.0863 7.7624 6.6518 63.6961 40.4260 2.8529 6.6121 0.2637 12.2583 0.1812 32.9043 43.5977 2.3723 12.2362 16.1146 6.4333 35.2595 17.3462 58.2114 29.3384 26.5588 8.1213 24.6318 5.7923 13.3095 23.7273 9.4398 0.1257 145.7739 10.7640 200.8980 2.9870 13.0479 16.0477 41.1357 7.1579 83.7397 121.6619 26.3684 25.9722 29.2218 10.5658 0.0296 70.3564 48.7727 11.2180 5.6360 10.6708 2.5244 24.8907 31.3800
temp: 298.150 k
press: 1.00000 atm
elementType: 35 8 7 7 6 6 6 6 6 6 6 6 6 6 1 1 1 1 1 1 1 1 1 1 1 1 1
symmnumber: 1
zpe: 561808.8 jmol-1
zpe.correction: 0.213982 hartree
zpe.thermalcorrener: 0.227991 hartree
zpe.thermalcorrenthalpy: 0.228935 hartree
zpe.thermalcorrgfe: 0.170682 hartree
zpe.sumelectzpe: -585.987431 hartree
zpe.sumelectthermal: -585.973422 hartree
zpe.sumelectthermalent: -585.972477 hartree
zpe.sumelectthermalfe: -586.030731 hartree
dipole: -3.9310 0.2395 -3.0761
dipole: 4.9973
quadrupole: -90.1756 -84.3344 -97.8215
quadrupole: 5.0226 10.4187 1.6735
quadrupole: 0.6016 6.4428 -7.0443 5.0226 10.4187 1.6735
hfenergy: -586.2014126 hartree
pointgroup: C01 [X(C10H13Br1N2O1)]
dipole: 1.5384263 -0.3206261 -1.1814981 debye
polarizability: 221.8644893|-14.0585039|121.5674354|-9.4472391|-12.2788265|90.2815102 unknown
InChI: InChI=1S/C10H13BrN2O/c1-2-3-10(14)13-12-9-6-4-8(11)5-7-9/h4-7,12-13H,2-3H2,1H3
charge 0 multiplicity 1
27 atoms
Br -5.510056 1.241703 0.109491
O  1.89497 -0.310545 1.484729
N  1.254804 -0.515715 -0.739815
N  0.128608 -1.298873 -0.443757
C  3.308391 0.757431 -0.232701
C  4.641355 0.277646 0.39479
C  2.112298 -0.051683 0.267105
C  5.822929 1.196821 0.023409
C  -1.137162 -0.672211 -0.283979
C  -2.208193 -1.431756 0.260272
C  -1.376399 0.658745 -0.711167
C  -3.494865 -0.870178 0.380075
C  -2.665638 1.22242 -0.595688
C  -3.714533 0.45465 -0.053099
H  3.135206 1.811512 0.062892
H  3.372521 0.740244 -1.339023
H  4.850985 -0.758809 0.065222
H  4.510726 0.24026 1.491594
H  5.649195 2.229804 0.379366
H  5.975825 1.238772 -1.071719
H  6.76247 0.837269 0.480289
H  1.509025 -0.436128 -1.726933
H  0.336106 -2.067941 0.201605
H  -2.037898 -2.46272 0.592214
H  -0.556938 1.25937 -1.116261
H  -4.312346 -1.459518 0.805248
H  -2.842385 2.251631 -0.921459
