program: Gaussian 09
title: 000053001
version: EM64L-G09RevD.01
frameworkgroup: C1[X(C12H12N2O3)]
method: RPBEPBE
basis: SDD
operation: Freq
keyword: #p
keyword: freq=noraman
keyword: PBEPBE/SDD
title: #p freq=noraman PBEPBE/SDD
converged: YES YES NO NO
title: Mulliken charges:
elementType: O O O N N C C C C C C C C C C C C H H H H H H H H H H H H
charge: -0.276410 -0.444095 -0.256770 -0.111938 -0.097214 -0.403103 -0.259480 0.389531 -0.156738 -0.208574 -0.333090 -0.369692 0.249277 -0.353456 -0.299939 -0.325941 0.111822 0.250786 0.214157 0.221276 0.233084 0.278640 0.255495 0.251490 0.254248 0.271820 0.278322 0.252252 0.384241
chargesum: 0.00000
title: Mulliken charges with hydrogens summed into heavy atoms:
elementType: O O O N N C C C C C C C C C C C C
charge: -0.276410 -0.059854 -0.256770 -0.111938 -0.097214 0.061839 0.194880 0.389531 0.121902 0.046921 -0.081599 -0.115444 0.249277 -0.081636 -0.021617 -0.073689 0.111822
polarizability: 2.27273961e+02 1.23590658e+01 1.40374232e+02 -2.96085082e+00 1.25904897e+01 9.56087613e+01
1716.lowfreq: -2.3712 0.0009 0.0010 0.0010 0.2152 10.3117 20.7206 31.4024 41.8415
frequency: 20.6934 31.1978 41.7856 71.4808 82.0219 110.5276 138.9369 170.8869 204.2175 217.4916 289.9139 330.9984 353.8256 405.1923 416.2105 474.2035 497.7776 506.6648 582.7153 588.5402 617.9090 626.4954 651.7862 659.2872 684.4340 696.6008 735.7159 755.7922 772.4838 787.3036 828.0896 849.8602 854.8009 879.2072 894.4225 964.9004 978.6384 988.2324 994.8603 1005.2183 1020.3548 1022.6609 1055.4293 1084.3163 1108.0484 1119.5100 1149.9495 1183.4183 1187.1181 1223.1030 1228.1438 1230.8798 1268.7011 1303.4453 1323.2042 1333.8116 1356.8444 1370.7191 1376.8201 1386.3119 1428.2108 1433.8517 1461.2586 1468.1154 1480.7164 1499.0285 1577.4789 1620.3025 1642.3592 2969.8741 3013.0349 3042.9235 3076.2989 3152.2282 3161.4297 3172.4012 3184.7573 3223.9416 3229.5598 3263.2208 3535.5024
redmass: 7.2140 5.0196 4.6542 6.0836 6.3153 5.2580 7.3512 3.2495 5.4458 4.8588 5.8851 2.5761 4.1437 4.6590 2.9851 3.6454 2.7678 5.3861 4.3322 1.2183 3.4581 7.0251 3.5114 2.9184 3.5320 4.3262 1.3147 4.5408 1.3335 4.7288 1.2867 1.4097 1.6628 6.3281 3.5325 2.2872 1.3843 1.3544 4.0490 3.4299 2.8145 2.6070 1.7004 2.2886 1.8178 1.3022 1.6303 1.3446 1.3066 1.8144 3.0965 1.2576 1.8681 1.2896 2.8912 2.5825 2.4535 1.6876 1.8450 2.8651 4.1210 1.8858 1.2707 1.4776 2.5979 2.4907 7.5730 6.3391 8.5669 1.0565 1.0638 1.1040 1.1030 1.0883 1.0890 1.0960 1.0971 1.0967 1.0935 1.1077 1.0642
irintensity: 1.8032 0.5739 2.8385 1.8638 0.2922 3.2053 0.9905 3.4589 0.1301 4.6569 6.1461 0.4864 3.4337 3.3458 0.3409 6.8331 35.1820 2.4535 62.6123 82.3528 21.1556 4.0957 6.7732 11.9405 72.2358 4.5705 10.0955 24.7691 107.4953 2.6340 5.0016 3.5158 60.2508 12.0129 50.2806 2.0852 2.5479 0.1215 159.1739 17.1513 235.0914 15.6199 26.1922 2.5988 9.1063 15.3056 225.9402 21.9787 19.3695 31.1384 255.6643 15.3122 40.1390 1.6667 161.0438 3.4262 8.5525 0.5862 32.4213 27.6445 5.6402 43.1425 19.8766 38.6875 13.2265 67.4237 0.0035 282.7554 288.9546 30.9523 18.0907 43.1091 12.1647 2.6654 2.8683 10.3801 2.6273 3.3480 2.9607 1.8037 51.6541
temp: 298.150 k
press: 1.00000 atm
elementType: 8 8 8 7 7 6 6 6 6 6 6 6 6 6 6 6 6 1 1 1 1 1 1 1 1 1 1 1 1
symmnumber: 1
zpe: 584558.8 jmol-1
zpe.correction: 0.222647 hartree
zpe.thermalcorrener: 0.237588 hartree
zpe.thermalcorrenthalpy: 0.238532 hartree
zpe.thermalcorrgfe: 0.177762 hartree
zpe.sumelectzpe: -798.412770 hartree
zpe.sumelectthermal: -798.397828 hartree
zpe.sumelectthermalent: -798.396884 hartree
zpe.sumelectthermalfe: -798.457654 hartree
dipole: 1.0192 -2.1544 2.9541
dipole: 3.7956
quadrupole: -128.3752 -87.6188 -104.0413
quadrupole: 21.4113 -6.7356 0.8387
quadrupole: -21.6967 19.0596 2.6371 21.4113 -6.7356 0.8387
hfenergy: -798.6354162 hartree
pointgroup: C01 [X(C12H12N2O3)]
dipole: -0.3821166 -1.2481171 -0.7253664 debye
polarizability: 226.6114367|-12.3969852|123.5087512|7.1282103|-25.7235761|113.1367666 unknown
InChI: InChI=1S/C12H12N2O3/c15-12(16)10-1-3-11(4-2-10)17-8-7-14-6-5-13-9-14/h1-6,9,15H,7-8H2
charge 0 multiplicity 1
29 atoms
O  0.82549 -0.637837 -0.633234
O  -5.295435 1.159828 -0.876868
O  -5.464465 -0.17873 1.014405
N  3.784289 -0.331216 0.080035
N  5.370402 1.018298 0.987924
C  3.024475 -1.550444 -0.224645
C  1.576681 -1.521835 0.276602
C  -0.54084 -0.446221 -0.39187
C  3.548786 0.958334 -0.42285
C  4.894855 -0.2395 0.924345
C  -1.253065 -1.040247 0.682789
C  -1.204469 0.402743 -1.315174
C  -3.302747 0.066488 -0.096165
C  -2.629071 -0.778444 0.821109
C  -2.576001 0.656397 -1.16716
C  4.531515 1.771107 0.146861
C  -4.751639 0.303942 0.099092
H  3.016851 -1.729248 -1.315539
H  3.546387 -2.39893 0.253196
H  1.146247 -2.543137 0.237153
H  1.525397 -1.137148 1.31381
H  2.72429 1.164753 -1.09859
H  5.307564 -1.1002 1.447236
H  -0.754461 -1.693198 1.40426
H  -0.62734 0.844727 -2.132592
H  -3.202491 -1.222856 1.64127
H  -3.099638 1.308137 -1.871377
H  4.687556 2.83827 0.007669
H  -6.264521 1.277865 -0.687694
