program: Gaussian 09
title: 000053019
version: EM64L-G09RevD.01
frameworkgroup: C1[X(C13H11IN2O)]
method: RPBEPBE
basis: SDD
operation: Freq
keyword: #p
keyword: freq=noraman
keyword: PBEPBE/SDD
title: #p freq=noraman PBEPBE/SDD
converged: YES YES NO NO
title: Mulliken charges:
elementType: I O N N C C C C C C C C C C C C C H H H H H H H H H H H
charge: 0.108295 -0.266618 -0.365085 -0.396344 0.298777 0.435591 0.144317 -0.287514 -0.353168 -0.410238 -0.341832 -0.331965 -0.203644 -0.174527 -0.198322 -0.204677 -0.262878 0.315981 0.252457 0.279052 0.329479 0.226500 0.232902 0.242267 0.256182 0.224347 0.222788 0.227878
chargesum: 0.00000
title: Mulliken charges with hydrogens summed into heavy atoms:
elementType: I O N N C C C C C C C C C C C C C
charge: 0.108295 -0.266618 -0.049104 -0.066865 0.298777 0.435591 0.144317 -0.035057 -0.074116 -0.183738 -0.108930 -0.331965 0.038623 0.081656 0.026024 0.018111 -0.035000
polarizability: 2.64891118e+02 -1.85767801e+00 2.08684635e+02 1.96417823e+00 3.73372955e+00 8.24378349e+01
1716.lowfreq: -6.7832 0.0006 0.0007 0.0007 1.5342 6.3184 10.5770 25.4236 33.9950
frequency: 9.1042 25.3916 33.9818 52.6656 86.6079 128.4307 168.8580 190.4556 212.9766 240.9482 254.4314 283.0750 296.3532 401.6038 406.7439 431.8742 457.0590 479.5762 516.8053 529.4110 539.1701 613.0172 634.5178 639.3219 675.0746 692.9411 699.1238 721.0585 756.8138 808.9225 815.7264 827.3960 883.4862 890.5483 895.2564 936.3695 961.0277 981.2275 981.5850 982.1950 998.2389 1022.1296 1043.9503 1068.6721 1086.3248 1102.6038 1170.1130 1177.1390 1181.9868 1183.7501 1256.2434 1293.4381 1298.2951 1316.4015 1371.5010 1384.1300 1399.5334 1424.6036 1442.7929 1467.5103 1485.0967 1509.4582 1556.4114 1591.7802 1596.4801 1604.7716 1620.2852 3121.0104 3129.4162 3142.7595 3145.8239 3154.2126 3154.6646 3166.2530 3169.2664 3177.8071 3474.1679 3523.2128
redmass: 5.0472 7.1305 4.1446 7.6635 6.2565 6.2602 4.8378 4.9007 4.0683 8.7557 4.6492 3.3366 5.6715 4.2748 3.0198 3.4529 2.2117 4.7160 2.3461 3.5516 1.8398 6.2534 4.2240 5.4352 3.8725 1.9708 5.0746 3.0580 1.7111 1.5305 3.0246 1.4578 2.1575 2.3970 1.5178 1.3888 1.3694 1.5598 3.3873 5.9190 1.3600 2.2087 4.2604 2.0794 1.5586 1.6807 1.0811 1.6850 1.1501 1.4907 2.4320 1.3342 2.7133 1.3963 9.7134 4.5033 2.7150 1.9160 2.1023 2.2632 2.4463 1.4825 6.3605 7.4410 6.4236 5.1247 6.1888 1.0863 1.0866 1.0928 1.0874 1.0920 1.0942 1.0929 1.1012 1.0989 1.0755 1.0785
irintensity: 0.3962 0.2912 0.5248 6.9503 2.0110 0.7358 3.1660 2.6323 7.6062 1.1634 7.2277 4.0680 13.9937 7.9579 0.2378 10.0902 102.9158 13.1598 92.9596 33.4245 36.3864 2.8007 38.6617 35.1064 8.1081 29.4506 23.4046 53.9043 98.5697 32.4127 7.4931 5.9377 0.6067 16.7661 18.7572 1.0093 0.2432 3.9294 8.3039 0.9331 1.0920 3.4223 55.0052 10.2266 12.8428 1.4659 0.1222 14.7105 5.2693 5.9286 185.3096 1.3297 16.2232 9.4624 0.9712 46.9022 11.8745 110.5331 25.3567 66.4157 116.2364 28.7757 136.1159 65.8252 1.6003 35.0835 115.8622 9.4334 1.1698 21.9783 6.0067 1.3808 43.3745 0.3112 15.7134 10.3191 31.7138 35.3506
temp: 298.150 k
press: 1.00000 atm
elementType: 53 8 7 7 6 6 6 6 6 6 6 6 6 6 6 6 6 1 1 1 1 1 1 1 1 1 1 1
symmnumber: 1
zpe: 551199.5 jmol-1
zpe.correction: 0.209941 hartree
zpe.thermalcorrener: 0.225248 hartree
zpe.thermalcorrenthalpy: 0.226192 hartree
zpe.thermalcorrgfe: 0.162454 hartree
zpe.sumelectzpe: -697.007237 hartree
zpe.sumelectthermal: -696.991930 hartree
zpe.sumelectthermalent: -696.990985 hartree
zpe.sumelectthermalfe: -697.054724 hartree
dipole: -1.5302 -0.1277 1.4013
dipole: 2.0788
quadrupole: -105.5139 -109.2275 -118.3607
quadrupole: -7.7333 4.1666 4.8693
quadrupole: 5.5202 1.8065 -7.3267 -7.7333 4.1666 4.8693
hfenergy: -697.2171778 hartree
pointgroup: C01 [X(C13H11I1N2O1)]
dipole: -0.5477545 -0.1881855 0.577445 debye
polarizability: 260.8615627|14.3829192|212.5647421|-3.9676615|-5.323158|82.587283 unknown
InChI: InChI=1S/C13H11IN2O/c14-11-6-4-5-10(9-11)13(17)16-15-12-7-2-1-3-8-12/h1-9,15-16H
charge 0 multiplicity 1
28 atoms
I  -4.046886 -3.260864 0.464953
O  -0.272178 2.277549 -0.564674
N  1.614717 0.959352 0.947395
N  0.301278 0.480784 0.789549
C  -2.01262 0.652634 -0.026087
C  2.693167 0.230188 0.367441
C  -0.613764 1.202961 0.01978
C  -2.295249 -0.720133 0.205086
C  -3.064195 1.543212 -0.354948
C  3.983595 0.82682 0.371444
C  2.529631 -1.081603 -0.146736
C  -3.627807 -1.17323 0.127862
C  -4.390533 1.071951 -0.427098
C  -4.686431 -0.290569 -0.180972
C  5.088395 0.118134 -0.140368
C  3.647868 -1.782289 -0.650263
C  4.932322 -1.193301 -0.651589
H  1.653215 1.981932 0.856643
H  -1.487709 -1.432764 0.398983
H  -2.816597 2.589958 -0.55688
H  -0.017774 -0.18148 1.500301
H  4.115869 1.837841 0.775725
H  1.535166 -1.538096 -0.173829
H  -5.205823 1.7588 -0.676952
H  -5.716784 -0.652639 -0.23902
H  6.076696 0.591665 -0.137597
H  3.508849 -2.793276 -1.050206
H  5.794583 -1.741337 -1.044943
