program: Gaussian 09
title: 000053010
version: EM64L-G09RevD.01
frameworkgroup: C1[X(C21H22)]
method: RPBEPBE
basis: SDD
operation: Freq
keyword: #p
keyword: freq=noraman
keyword: PBEPBE/SDD
title: #p freq=noraman PBEPBE/SDD
converged: YES YES NO NO
title: Mulliken charges:
elementType: C C C C C C C C C C C C C C C C C C C C C H H H H H H H H H H H H H H H H H H H H H H
charge: -0.031980 -0.188056 -0.470756 0.083161 -0.558450 0.326215 0.248441 -0.777182 -0.778700 0.232321 -0.437847 -0.433591 0.200343 -0.479911 0.245658 -0.488554 -0.384642 0.317440 -0.261133 -0.464529 -0.838548 0.211531 0.209707 0.205042 0.208806 0.224156 0.222068 0.244398 0.226919 0.226161 0.213746 0.218149 0.220806 0.229708 0.221085 0.238583 0.240127 0.222079 0.223853 0.231861 0.231856 0.232055 0.237604
chargesum: 0.00000
title: Mulliken charges with hydrogens summed into heavy atoms:
elementType: C C C C C C C C C C C C C C C C C C C C C
charge: 0.177727 0.023475 -0.056908 0.083161 -0.112225 0.326215 0.248441 -0.079704 -0.125999 0.232321 -0.208139 -0.212506 0.200343 -0.241328 0.245658 -0.248427 -0.162563 0.317440 -0.037280 -0.232667 -0.137033
polarizability: 3.64661260e+02 9.97726958e+00 2.38471567e+02 -8.80884946e-01 2.21170667e+00 1.19493734e+02
1716.lowfreq: -12.9940 -5.0839 -0.0002 -0.0001 0.0005 7.1759 42.3939 56.3606 91.8478
frequency: 42.3559 56.3573 91.8478 101.9494 131.5967 169.1771 175.8838 184.1398 198.8508 204.8842 235.8683 248.7014 255.3514 272.8050 303.7425 306.1338 330.5365 342.5492 391.5701 430.1438 451.0212 459.9883 487.4177 512.4185 522.4157 527.5349 534.9892 562.9056 588.1673 599.1405 613.1885 635.4289 674.5967 731.9084 760.5281 763.3971 776.7690 800.4027 819.1401 830.2974 836.4282 847.7810 865.9104 894.4272 900.3566 904.4180 947.4393 960.9554 963.6030 976.6032 978.7982 984.1211 1005.7116 1028.1260 1043.5880 1044.8032 1057.5526 1088.7444 1103.0696 1106.5666 1130.3801 1159.9023 1179.1929 1183.3249 1190.9550 1204.3135 1215.3004 1239.0856 1248.1584 1251.0216 1259.2298 1271.4232 1298.7276 1305.0509 1322.9555 1329.2803 1339.6107 1366.9061 1369.4523 1384.1812 1386.4021 1391.7744 1395.3201 1403.7587 1406.5478 1448.8883 1451.5135 1462.4273 1467.0274 1471.6707 1473.4273 1477.9098 1481.7888 1487.4230 1494.6403 1498.1917 1534.7206 1580.2237 1605.0841 1613.2009 1622.0681 2947.8443 2953.1722 2969.8274 2971.9385 2972.7719 2981.6565 2986.0436 3010.3259 3038.4929 3046.8997 3061.4324 3068.8714 3079.0495 3081.8568 3084.1511 3112.4798 3122.1599 3139.6285 3141.3207 3157.2082 3164.6157 3168.4731
redmass: 3.9735 3.3494 2.9882 3.2397 3.7022 1.5031 1.8627 2.0208 1.9380 1.1960 2.8229 2.5687 1.9439 2.8282 2.8706 2.7476 2.9202 2.9907 4.2422 3.4337 3.3301 4.6818 3.1990 3.9442 3.3546 5.3648 3.7456 2.7440 3.6096 3.9919 4.3898 3.9556 3.3556 2.1837 3.3413 2.5825 1.8841 1.6702 2.8796 2.7803 1.9224 2.6716 3.3469 2.4626 2.4333 1.4384 1.4404 1.6928 1.4053 1.3377 1.3428 1.9364 1.6755 1.8469 2.4712 1.5647 1.6282 1.9892 2.5068 1.7826 2.3110 1.7443 1.5229 1.4241 1.3582 2.2287 1.7699 1.6142 1.8186 1.5566 1.8071 1.5331 1.5684 1.4736 1.5469 2.0080 1.5336 1.6658 2.8082 1.4401 2.7082 1.2208 1.4362 2.6731 2.9215 1.5843 2.6858 1.6259 1.0743 1.0558 1.0471 1.0592 1.1534 1.0629 1.0603 3.1770 4.4889 7.6943 6.2213 6.3243 6.6283 1.0818 1.0637 1.0437 1.0380 1.0749 1.0523 1.0461 1.0929 1.1026 1.0974 1.0989 1.0990 1.0996 1.0987 1.0980 1.0884 1.0866 1.0854 1.0919 1.0963 1.0960 1.0935
irintensity: 0.0939 0.3523 0.4947 0.2722 0.2547 0.7314 0.4237 0.8143 0.2740 0.1705 0.5779 3.4660 1.8430 0.7176 0.2892 0.5160 0.0596 6.5573 0.4475 0.1336 0.3437 0.8916 2.4511 11.1206 0.6623 0.9416 0.5468 1.7274 0.9036 0.5175 0.2273 0.5126 0.4428 0.1514 3.0050 0.7467 35.0684 40.1158 6.6676 1.6797 43.8022 8.8881 6.1826 4.2571 1.5848 0.1571 6.2192 3.6894 1.8744 0.2787 0.4525 1.6879 1.0110 1.2690 1.6483 6.6592 32.1739 9.3104 1.9898 0.4157 0.4035 2.8103 2.4151 0.0179 2.1588 2.2938 2.1122 7.6098 9.1518 6.5498 3.6035 1.7531 3.3294 1.0922 1.3729 0.4071 0.6703 2.2278 4.2945 8.6204 3.6888 21.4030 11.5030 8.0353 3.8437 12.9768 12.4143 9.5885 2.2823 6.5801 14.4211 15.7900 31.0299 15.7929 1.8095 0.4251 7.6010 4.4000 9.4430 4.2969 5.7142 17.5324 29.8296 24.9819 34.9247 41.7275 18.1540 67.2904 41.4809 45.8232 20.2765 40.5948 61.4771 31.2013 35.7024 22.3292 17.4379 11.0020 0.7647 28.8079 4.6052 30.9935 35.5024
temp: 298.150 k
press: 1.00000 atm
elementType: 6 6 6 6 6 6 6 6 6 6 6 6 6 6 6 6 6 6 6 6 6 1 1 1 1 1 1 1 1 1 1 1 1 1 1 1 1 1 1 1 1 1 1
symmnumber: 1
zpe: 958973.1 jmol-1
zpe.correction: 0.365254 hartree
zpe.thermalcorrener: 0.383260 hartree
zpe.thermalcorrenthalpy: 0.384204 hartree
zpe.thermalcorrgfe: 0.320677 hartree
zpe.sumelectzpe: -811.985941 hartree
zpe.sumelectthermal: -811.967935 hartree
zpe.sumelectthermalent: -811.966991 hartree
zpe.sumelectthermalfe: -812.030517 hartree
dipole: 0.8190 -0.4297 -0.1291
dipole: 0.9339
quadrupole: -111.2138 -113.5748 -131.1228
quadrupole: 2.6219 -0.5729 0.8182
quadrupole: 7.4233 5.0623 -12.4857 2.6219 -0.5729 0.8182
hfenergy: -812.3511944 hartree
pointgroup: C01 [X(C21H22)]
dipole: -0.3220164 0.1698887 -0.0494397 debye
polarizability: 364.6908652|9.7868661|238.4682731|0.8219053|-1.3740795|119.4674226 unknown
InChI: InChI=1S/C21H22/c1-13-7-8-16-9-10-19-18-6-4-5-14(2)17(18)11-12-20(19)21(16)15(13)3/h4-6,9-13,15H,7-8H2,1-3H3
charge 0 multiplicity 1
43 atoms
C  -4.084866 0.715138 -0.577593
C  -2.685816 1.12846 -0.025209
C  -4.604361 -0.539114 0.161058
C  -1.703246 -0.053513 -0.036858
C  -3.66368 -1.734598 -0.08476
C  -2.17987 -1.381438 -0.015781
C  -0.274838 0.187903 -0.037994
C  -2.755383 1.753357 1.400298
C  -5.109013 1.869398 -0.543374
C  0.661461 -0.910403 0.00404
C  -1.243663 -2.458334 0.028824
C  0.13291 -2.236903 0.04338
C  2.106627 -0.652786 0.000862
C  0.261884 1.531696 -0.08838
C  2.589362 0.706353 -0.049092
C  1.622374 1.777517 -0.096547
C  3.068007 -1.71046 0.044761
C  4.005317 0.981496 -0.055934
C  4.439957 -1.436769 0.039812
C  4.906584 -0.093532 -0.010845
C  4.527541 2.407201 -0.11212
H  -2.301625 1.912507 -0.709514
H  -3.933646 0.430394 -1.641973
H  -5.626619 -0.787444 -0.184019
H  -4.680152 -0.325695 1.245193
H  -3.86939 -2.153417 -1.092726
H  -3.880263 -2.552258 0.630618
H  -1.743681 1.978324 1.780068
H  -3.334599 2.694245 1.400218
H  -3.224993 1.058047 2.118909
H  -4.706843 2.784794 -1.018162
H  -6.029508 1.585166 -1.086782
H  -5.401527 2.125159 0.491744
H  -1.627142 -3.48639 0.051556
H  0.804065 -3.099229 0.082983
H  -0.424897 2.381611 -0.129906
H  1.978952 2.811301 -0.141969
H  2.7407 -2.753047 0.083358
H  5.161877 -2.260322 0.074825
H  5.98479 0.104932 -0.015184
H  4.192989 2.931229 -1.027728
H  4.180849 3.006813 0.751024
H  5.630376 2.417912 -0.105081
