program: Gaussian 09
title: 000052956
version: EM64L-G09RevD.01
frameworkgroup: C1[X(C4H5N5O4S2)]
method: RPBEPBE
basis: SDD
operation: Freq
keyword: #p
keyword: freq=noraman
keyword: PBEPBE/SDD
title: #p freq=noraman PBEPBE/SDD
converged: YES YES NO NO
title: Mulliken charges:
elementType: S S O O O O N N N N N C C C C H H H H H
charge: 1.001801 0.370100 -0.484957 -0.528665 -0.165979 -0.261699 -0.343828 0.066368 -0.716009 -0.011121 -0.577890 -0.319591 -0.086171 0.112630 0.138034 0.380923 0.344423 0.355819 0.371772 0.354038
chargesum: 0.00000
title: Mulliken charges with hydrogens summed into heavy atoms:
elementType: S S O O O O N N N N N C C C C
charge: 1.001801 0.370100 -0.484957 -0.528665 -0.165979 -0.261699 0.037095 0.066368 -0.015766 -0.011121 0.147920 -0.319591 -0.086171 0.112630 0.138034
polarizability: 2.32949115e+02 8.59120251e+00 1.32166668e+02 1.11529988e+00 9.05447664e-01 7.39687379e+01
1716.lowfreq: -6.0672 0.0009 0.0018 0.0026 0.5883 5.6789 19.1465 31.9095 45.4417
frequency: 19.0852 31.8995 45.4207 63.1697 84.8452 107.8542 122.9985 148.2332 168.2217 212.8930 238.9457 257.7522 273.1735 306.3115 320.6861 344.4017 368.3008 418.0762 435.1261 453.1118 512.7603 547.9257 549.6819 570.2425 587.0090 634.3501 642.8221 684.4058 758.8982 764.4583 772.3225 813.6349 829.1704 856.9487 907.5218 929.3658 1004.5070 1065.3657 1072.7211 1100.0773 1148.4172 1350.1696 1371.7694 1465.3370 1503.9733 1527.8566 1569.2164 1659.4540 1666.8292 3348.4936 3386.8882 3498.2136 3559.8397 3659.0015
redmass: 8.9661 8.1617 11.2892 8.6381 5.2183 3.3854 9.7303 3.3664 7.3242 7.3911 2.9942 4.8058 11.6440 5.8935 5.6133 8.0390 7.0963 12.2187 3.1055 4.1517 11.4021 8.8733 6.9423 10.5202 9.6785 1.3001 6.6089 1.1604 3.0164 3.0389 4.4326 10.8588 1.3332 8.7176 10.4682 3.9757 11.0782 2.0625 1.5835 7.6188 2.9441 3.4524 11.9443 2.1734 5.1415 1.0886 1.4347 6.4031 4.6555 1.0769 1.0410 1.0465 1.1021 1.1035
irintensity: 1.0106 4.3973 1.3134 0.9102 9.3648 15.2387 6.5840 12.9903 9.7189 5.0747 22.3704 18.9684 1.6381 4.8450 17.5052 0.2529 4.0292 128.9453 160.1581 16.1757 25.1444 14.3559 36.4484 3.0392 1.0593 68.3492 1.9556 232.7345 74.3889 129.2090 38.6924 58.7035 95.5991 4.6291 34.0138 63.6703 17.4076 7.7696 24.3925 37.6431 13.8511 134.0399 15.3472 77.5273 1214.2082 40.0295 117.8582 255.4293 118.2508 232.3340 49.9452 83.4760 37.5181 85.0481
temp: 298.150 k
press: 1.00000 atm
elementType: 16 16 8 8 8 8 7 7 7 7 7 6 6 6 6 1 1 1 1 1
symmnumber: 1
zpe: 303493.5 jmol-1
zpe.correction: 0.115595 hartree
zpe.thermalcorrener: 0.131702 hartree
zpe.thermalcorrenthalpy: 0.132646 hartree
zpe.thermalcorrgfe: 0.069428 hartree
zpe.sumelectzpe: -1524.865294 hartree
zpe.sumelectthermal: -1524.849186 hartree
zpe.sumelectthermalent: -1524.848242 hartree
zpe.sumelectthermalfe: -1524.911461 hartree
dipole: -4.4732 0.9073 3.0386
dipole: 5.4832
quadrupole: -69.7725 -116.7972 -101.1422
quadrupole: 1.5481 16.8063 -2.4413
quadrupole: 26.1315 -20.8932 -5.2383 1.5481 16.8063 -2.4413
hfenergy: -1524.9808886 hartree
pointgroup: C01 [X(C4H5N5O4S2)]
dipole: 1.6771052 -0.8647722 1.0456035 debye
dipolederiv: 2.5533678 0.0280257 -0.1409868 0.1262969 1.2168125 -0.1356367 -0.0726246 -0.1544613 1.5771864 -0.3775871 0.0560912 -0.0262035 -0.2306352 -0.2503439 -0.2461434 -0.1637155 -0.2112485 0.0821848 -0.7767163 0.0513452 -0.0179147 0.1426059 -0.581932 0.1739086 -0.012602 0.0231824 -0.5099041 -0.7572827 -0.0442365 -0.0083315 -0.1403634 -0.5373348 -0.1290046 -0.0488021 0.0203012 -0.5244715 -0.6741601 -0.0032806 -0.0334768 -0.674251 -0.6688848 -0.2233477 -0.3373049 -0.1701476 -0.3926486 -0.8887161 0.0574176 -0.0182109 -0.0630246 -0.817882 -0.2144647 -0.07441 -0.2037549 -0.4464453 -2.4873557 -0.1552768 -0.2514621 -0.0414066 -0.4345173 -0.0798633 -0.2136597 -0.0882712 -0.3331494 -0.1799837 0.0686391 0.046953 -0.0524589 -0.3314693 -0.1209574 -0.0281663 -0.1320278 -0.137681 -0.8157208 0.0208207 0.0898019 -0.0581388 -0.4150104 0.1183015 0.2413378 0.158919 -0.8165457 -0.6338013 -0.1070242 -0.0843408 0.4743724 -0.2987918 -0.0526285 0.1872906 -0.1007317 -0.1578858 -1.1653671 -0.4033714 -0.2227165 -0.2011433 -0.5203456 0.0361179 -0.1354133 0.0178841 -0.6422979 -0.0785221 -0.1201487 -0.0912062 -0.0834204 0.3309926 0.2645335 -0.1837895 0.251051 -0.09853 1.8473103 0.1198042 0.2134426 -0.4279091 0.4537948 0.1597987 -0.0296621 0.1978188 0.1952636 1.5037987 0.2141498 0.1980469 1.2232505 0.814509 0.3470334 0.6629818 0.2671997 0.4338851 1.4060496 0.2715064 0.2178198 0.2867565 0.9110438 0.3260558 0.2255364 0.3260576 0.3979639 0.4939237 -0.0622013 -0.0147909 -0.2617891 0.2720717 -0.0421516 -0.1053553 -0.0261661 0.2942789 0.2239625 0.0086423 0.0964283 -0.0366245 0.1143272 0.0638412 0.0532603 0.0093929 0.2040204 0.1596595 -0.0737784 0.0273831 0.0147837 0.2576433 -0.111444 0.0448641 -0.0570249 0.1468402 0.3736964 0.0367878 0.0144939 0.0297702 0.2703523 -0.0505676 0.0119749 -0.0497938 0.3678043 0.2734444 0.0360881 0.0052713 -0.0266713 0.2149648 -0.0833811 -0.0217407 -0.0781788 0.360132 unknown
polarizability: 232.1889413|4.5309569|122.1775785|12.881549|21.9920995|84.7180014 unknown
InChI: InChI=1S/C4H5N5O4S2/c5-1(10)2(11)7-3-8-9-4(14-3)15(6,12)13/h7H,5-6H2
charge 0 multiplicity 1
20 atoms
S  -3.938415 -0.1471 -0.25502
S  -0.961886 -1.333626 -0.530394
O  -4.516924 1.288809 -0.723262
O  -4.15182 -1.512232 -1.108109
O  2.836064 1.276484 1.053888
O  3.948897 -1.876928 -0.261195
N  1.667253 -0.584077 0.113034
N  -1.516353 1.047843 0.57891
N  -4.445777 -0.53561 1.449511
N  -0.118654 0.947842 0.681721
N  5.204804 -0.100432 0.639922
C  -2.065371 0.001999 0.003971
C  0.340818 -0.201845 0.165717
C  2.790618 0.135652 0.537119
C  4.054986 -0.723804 0.262753
H  1.934995 -1.504757 -0.2793
H  -4.727277 0.322452 1.948112
H  -5.157867 -1.2824 1.431277
H  5.145686 0.834354 1.051262
H  6.105722 -0.559223 0.511784
