program: Gaussian 09
title: 000053016
version: EM64L-G09RevD.01
frameworkgroup: C1[X(C15H14ClN2)]
method: RPBEPBE
basis: SDD
operation: Freq
keyword: #p
keyword: freq=noraman
keyword: PBEPBE/SDD
title: #p freq=noraman PBEPBE/SDD
converged: YES YES NO NO
title: Mulliken charges:
elementType: Cl N N C C C C C C C C C C C C C C C H H H H H H H H H H H H H H
charge: 0.010165 -0.181926 -0.425952 0.290872 0.390207 -0.580930 0.247507 0.516970 -0.332289 -0.735286 -0.324052 -0.207328 -0.190257 -0.357241 -0.427336 -0.189066 -0.184397 -0.135445 0.264851 0.259990 0.366719 0.261160 0.260270 0.299089 0.272639 0.267393 0.261459 0.263965 0.242659 0.245872 0.273405 0.276312
chargesum: 1.00000
title: Mulliken charges with hydrogens summed into heavy atoms:
elementType: Cl N N C C C C C C C C C C C C C C C
charge: 0.010165 -0.181926 -0.059233 0.290872 0.390207 -0.056089 0.247507 0.516970 -0.071130 0.096713 -0.056659 0.054131 0.073709 -0.114581 -0.181464 0.084339 0.091914 -0.135445
polarizability: 2.42661349e+02 -2.89970074e+01 1.66290430e+02 -3.95207816e+00 1.97782126e+00 1.25999797e+02
1716.lowfreq: -12.3932 -6.8228 0.0018 0.0018 0.0026 2.0988 17.2280 31.4858 40.7322
frequency: 17.1999 31.3843 40.7285 98.5712 104.7236 132.3811 153.1727 177.1971 257.1095 261.7101 293.3224 302.6207 321.3161 351.2428 405.4209 415.1389 426.8944 482.2669 492.4776 521.9486 567.2442 597.7565 626.1421 632.3727 653.2726 672.7455 682.0569 706.1366 748.3218 760.2678 767.8395 798.6953 833.2308 837.5993 847.2998 863.7226 892.2414 953.1492 956.1929 971.6259 982.3118 1002.0442 1002.3550 1012.7659 1018.8101 1046.3365 1078.9613 1111.3545 1118.8042 1148.3979 1183.5778 1191.7466 1204.3903 1220.4445 1242.8794 1264.1247 1299.6627 1310.1484 1335.9488 1339.0568 1384.6178 1403.5388 1413.8337 1422.7412 1436.9062 1449.9756 1450.7807 1469.4539 1481.6337 1484.4122 1517.1657 1544.5335 1584.0706 1602.4275 1616.5846 1630.3645 2996.1975 3029.9457 3077.0105 3083.3759 3117.8538 3128.2796 3132.0607 3159.3157 3165.9001 3175.1100 3176.2510 3178.0447 3188.8803 3578.5148
redmass: 5.1567 4.1443 6.0630 1.5389 2.5257 2.7345 5.0864 6.6063 3.3708 3.8557 4.0382 4.3237 5.8196 2.5998 3.1645 5.5000 3.0144 4.0243 4.2388 3.2638 3.5408 5.5217 6.7295 4.9414 4.9143 3.6040 1.2859 4.3441 4.2658 2.9501 1.5100 3.1784 1.7313 1.3226 3.2808 1.4047 3.9643 1.4107 1.3629 1.3725 1.8230 3.2335 1.4007 1.8875 1.9051 1.5089 3.0238 2.7624 1.3746 1.8945 1.1365 1.1259 2.3600 2.1928 2.0199 1.3895 1.2983 2.8337 1.6871 1.5499 4.2253 2.3984 1.5943 2.6958 1.9000 1.7156 1.2495 1.2077 2.1078 2.1985 2.2783 4.3122 7.1677 6.0880 7.1506 6.8923 1.0390 1.0600 1.0976 1.1039 1.0993 1.0909 1.0905 1.0879 1.0911 1.0951 1.0966 1.0960 1.1007 1.0827
irintensity: 0.8693 0.6993 1.3636 0.9748 0.5990 2.9564 2.6649 0.0990 0.7452 0.9662 3.0167 0.9666 0.0871 1.3172 5.2540 14.4100 7.9151 8.1383 8.9213 10.5658 3.0944 9.2807 0.4390 2.0904 4.3309 25.9817 51.4628 1.9958 9.7261 42.8797 95.9233 26.3320 30.1902 6.5611 11.5643 0.4152 4.1736 1.3919 1.7037 0.1048 3.0976 34.3761 2.0765 0.8177 3.7922 12.2596 63.7860 2.4249 7.2461 12.4874 1.4660 1.1827 9.4264 1.7432 8.3910 12.3188 1.5862 24.1324 6.7482 11.6279 6.1256 23.6765 9.7436 8.2383 115.6606 41.5827 26.8291 46.3734 41.0502 3.4508 37.1034 26.8571 1.2946 31.5262 16.0865 4.8267 1.4275 12.5880 1.3730 2.0989 2.3339 7.2428 9.2736 0.2923 1.8886 0.5172 2.1706 0.0901 0.9345 128.9753
temp: 298.150 k
press: 1.00000 atm
elementType: 17 7 7 6 6 6 6 6 6 6 6 6 6 6 6 6 6 6 1 1 1 1 1 1 1 1 1 1 1 1 1 1
symmnumber: 1
zpe: 669003.4 jmol-1
zpe.correction: 0.254810 hartree
zpe.thermalcorrener: 0.270201 hartree
zpe.thermalcorrenthalpy: 0.271145 hartree
zpe.thermalcorrgfe: 0.209887 hartree
zpe.sumelectzpe: -1148.102621 hartree
zpe.sumelectthermal: -1148.087230 hartree
zpe.sumelectthermalent: -1148.086286 hartree
zpe.sumelectthermalfe: -1148.147545 hartree
dipole: 8.3960 4.3131 -0.2865
dipole: 9.4434
quadrupole: -73.0732 -82.7481 -97.6360
quadrupole: -4.6478 -12.2928 -4.5944
quadrupole: 11.4126 1.7377 -13.1503 -4.6478 -12.2928 -4.5944
hfenergy: -1148.3574311 hartree
pointgroup: C01 [X(C15H14Cl1N2)]
dipole: 3.3857934 1.5294932 0.0257792 debye
polarizability: 239.574826|-32.6342785|169.3665254|4.3914222|-1.6500229|126.0102245 unknown
InChI: InChI=1S/C15H14ClN2/c1-11-17-14-4-2-3-5-15(14)18(11)10-12-6-8-13(16)9-7-12/h2-9,17H,10H2,1H3
charge 1 multiplicity 1
32 atoms
Cl -5.641863 -0.634642 -1.250662
N  0.891089 0.689752 0.553748
N  2.261998 1.363064 -1.049454
C  1.924867 -0.281646 0.465371
C  1.114017 1.672394 -0.371825
C  -0.278913 0.631847 1.479954
C  2.807464 0.154522 -0.565084
C  -1.594595 0.328924 0.771985
C  2.161298 -1.474469 1.178035
C  0.265165 2.8748 -0.604957
C  3.95715 -0.574195 -0.924541
C  3.312546 -2.205982 0.821346
C  4.193685 -1.765365 -0.209072
C  -1.723344 -0.804139 -0.072146
C  -2.720475 1.15951 0.991752
C  -2.95377 -1.100264 -0.694243
C  -3.961632 0.870547 0.381961
C  -4.060351 -0.256335 -0.458261
H  -0.340036 1.592182 2.021229
H  -0.037945 -0.142297 2.228437
H  2.654747 1.937018 -1.796886
H  1.497212 -1.829469 1.970936
H  0.653171 3.475435 -1.442475
H  -0.774269 2.582576 -0.8368
H  0.235254 3.521993 0.290925
H  4.636417 -0.241202 -1.71431
H  3.536233 -3.137584 1.349351
H  5.074741 -2.367418 -0.449515
H  -0.869477 -1.46964 -0.247469
H  -2.644782 2.031992 1.652282
H  -3.056945 -1.974809 -1.342763
H  -4.832756 1.507898 0.55715
