program: Gaussian 09
title: 000052963
version: EM64L-G09RevD.01
frameworkgroup: C1[X(C17H19NO)]
method: RPBEPBE
basis: SDD
operation: Freq
keyword: #p
keyword: freq=noraman
keyword: PBEPBE/SDD
title: #p freq=noraman PBEPBE/SDD
converged: YES YES NO NO
title: Mulliken charges:
elementType: O N C C C C C C C C C C C C C C C C C H H H H H H H H H H H H H H H H H H H
charge: -0.312566 -0.081091 0.067389 -0.499338 -0.525298 -0.402413 0.304304 0.211579 -0.411090 -0.626436 0.203874 -0.422562 -0.253025 0.142013 -0.378106 -0.355247 -0.251551 -0.218245 -0.526534 0.245100 0.240251 0.235273 0.206063 0.215780 0.188481 0.233050 0.226566 0.225422 0.187935 0.251121 0.226213 0.251097 0.251056 0.228053 0.229193 0.245520 0.230336 0.217833
chargesum: 0.00000
title: Mulliken charges with hydrogens summed into heavy atoms:
elementType: O N C C C C C C C C C C C C C C C C C
charge: -0.312566 -0.081091 0.067389 -0.013987 -0.083962 0.001849 0.304304 0.211579 -0.178040 0.013486 0.203874 -0.171441 -0.026812 0.142013 -0.127009 -0.104191 -0.023498 0.010948 0.167156
polarizability: 2.34088958e+02 1.97745326e+01 1.89100085e+02 1.73562429e+01 -7.43349918e+00 1.44911789e+02
1716.lowfreq: -2.4059 -0.0006 -0.0006 0.0004 8.4379 9.6612 41.7152 56.4778 59.9232
frequency: 41.6794 56.4438 59.8968 81.4134 84.9040 126.2388 129.3566 153.1429 199.0036 214.9097 229.1358 248.2168 251.5958 286.8114 316.3745 342.6627 347.8298 385.3289 424.9125 441.4848 478.2714 490.5382 504.1120 545.7679 549.4268 581.8264 605.1791 625.7360 668.8322 728.5813 745.1817 758.1600 771.7809 775.2821 798.7261 817.8340 849.2818 873.9671 908.7993 941.6670 949.6097 957.8572 970.5540 983.2683 986.4139 990.4042 1032.5946 1040.8468 1060.2187 1069.7406 1083.7454 1106.5045 1110.7764 1117.7805 1144.6017 1150.1307 1166.8355 1175.2147 1189.4923 1193.0010 1199.5320 1207.1298 1240.5374 1253.6005 1265.5441 1288.8847 1291.5179 1337.1054 1346.5572 1357.8382 1363.8517 1384.0055 1416.4835 1432.1868 1435.2602 1439.3848 1450.2056 1452.1074 1459.2879 1463.3658 1469.2980 1473.2521 1478.4472 1483.2908 1485.1231 1571.4299 1593.2412 1597.3554 1605.8828 2832.1275 2852.6281 2859.4698 2964.1903 2977.5813 3006.2110 3017.3427 3029.3373 3035.0106 3059.4049 3075.9707 3113.8478 3116.4212 3126.7111 3128.6534 3137.6916 3153.5109 3154.1374 3168.1384
redmass: 4.3598 3.0319 3.1672 3.5380 3.1156 2.9875 1.8418 1.6224 2.6081 3.3426 1.8851 3.0584 1.8464 3.4864 2.3459 3.5975 2.5742 4.8225 3.4745 4.5709 3.3936 4.7764 3.6173 3.5858 3.9042 3.6581 5.4742 4.5092 4.9273 2.7275 2.5326 4.2319 1.7518 1.9507 1.9413 3.4832 3.1893 1.4654 1.3979 2.7767 1.4923 5.3513 1.4545 1.3176 1.6509 2.3019 2.4105 2.0801 2.3073 2.3322 1.9959 1.6437 1.3766 1.3597 1.8807 1.3429 1.0708 1.3244 2.1816 1.9161 1.4756 1.8128 1.9361 1.5874 1.5761 1.7219 1.7957 1.9261 1.8852 5.3176 2.1669 1.9384 1.7289 1.2218 1.4577 1.4349 2.0211 1.6027 1.0532 1.0743 1.1851 1.0662 1.6652 1.2431 1.3208 6.4545 6.8366 6.4466 6.7905 1.0703 1.0651 1.0619 1.0321 1.0599 1.0865 1.0724 1.0944 1.0946 1.1029 1.1010 1.0869 1.1016 1.0862 1.0894 1.0901 1.0981 1.0957 1.1003
irintensity: 0.5059 1.2265 4.2322 1.8619 3.4376 0.3130 0.6144 3.7313 1.7163 2.1666 2.5397 2.5337 1.0681 6.4734 3.5784 0.6244 4.1701 0.3251 0.7898 4.9278 2.4366 8.5209 0.1139 0.5757 8.7862 0.8684 3.3951 2.2871 1.5752 6.7447 46.8583 4.5355 29.4197 43.8929 17.5855 3.2513 13.6693 1.6146 0.1763 5.7353 4.0778 49.0997 0.6923 0.2878 2.9368 8.8556 3.1314 26.2144 2.8745 13.1753 21.3081 21.1418 1.7420 7.8947 15.0800 0.4181 0.2678 1.9308 16.7087 44.8140 14.6427 1.9842 2.0162 13.6581 8.8189 4.7068 7.0910 0.5128 10.5744 5.3654 3.1142 5.2763 22.4673 5.3669 1.0681 12.0333 20.1240 31.2428 7.6011 15.1204 4.0501 13.7561 29.2119 4.0847 14.0887 6.2565 10.1399 0.8313 5.3914 67.3904 42.9616 151.8017 68.9372 30.9505 18.4432 49.2275 38.7511 47.6179 32.6039 35.0542 6.8697 21.2592 6.2262 16.0058 8.9789 22.1171 31.6769 22.1922
temp: 298.150 k
press: 1.00000 atm
elementType: 8 7 6 6 6 6 6 6 6 6 6 6 6 6 6 6 6 6 6 1 1 1 1 1 1 1 1 1 1 1 1 1 1 1 1 1 1 1
symmnumber: 1
zpe: 828832.5 jmol-1
zpe.correction: 0.315686 hartree
zpe.thermalcorrener: 0.332907 hartree
zpe.thermalcorrenthalpy: 0.333852 hartree
zpe.thermalcorrgfe: 0.270773 hartree
zpe.sumelectzpe: -787.780254 hartree
zpe.sumelectthermal: -787.763032 hartree
zpe.sumelectthermalent: -787.762088 hartree
zpe.sumelectthermalfe: -787.825166 hartree
dipole: -0.2017 0.6194 1.1489
dipole: 1.3207
quadrupole: -101.1959 -107.6828 -110.4867
quadrupole: 0.3012 3.9145 0.6679
quadrupole: 5.2592 -1.2276 -4.0316 0.3012 3.9145 0.6679
hfenergy: -788.0959395 hartree
pointgroup: C01 [X(C17H19N1O1)]
dipole: -0.1232504 -0.3913668 -0.3188145 debye
polarizability: 229.7941577|-28.6533379|179.8543337|-15.9642888|-17.876526|158.4523407 unknown
InChI: InChI=1S/C17H19NO/c1-18-11-10-13-6-5-8-14(16(13)12-18)15-7-3-4-9-17(15)19-2/h3-9H,10-12H2,1-2H3
charge 0 multiplicity 1
38 atoms
O  -1.486967 0.225061 -1.896159
N  2.399276 1.819615 -0.283302
C  1.030104 -0.223754 0.20912
C  1.044072 1.219567 -0.280304
C  3.567338 -0.332952 -0.108361
C  3.372909 0.9339 -0.957865
C  2.240028 -0.968074 0.28695
C  -0.198222 -0.838099 0.605755
C  2.21858 -2.302323 0.763737
C  2.376715 3.184595 -0.84015
C  -1.507875 -0.105541 0.571511
C  -0.188889 -2.167046 1.103012
C  1.013356 -2.902028 1.180484
C  -2.104065 0.385554 -0.627156
C  -2.210007 0.114808 1.787856
C  -3.321354 1.102725 -0.599274
C  -3.432078 0.821233 1.823847
C  -3.985521 1.328559 0.625653
C  -1.454283 -1.157269 -2.415232
H  0.582194 1.248112 -1.300269
H  0.394251 1.834967 0.370926
H  4.120315 -0.053494 0.809737
H  4.190803 -1.068331 -0.653869
H  4.33242 1.473942 -1.057969
H  3.034671 0.656956 -1.991409
H  3.158818 -2.865954 0.813742
H  3.383217 3.633999 -0.767387
H  1.678893 3.811939 -0.256404
H  2.053657 3.222136 -1.91221
H  -1.135491 -2.624719 1.412609
H  1.006681 -3.931374 1.555575
H  -1.763991 -0.254671 2.718465
H  -3.728286 1.467845 -1.547809
H  -3.940976 0.983619 2.780133
H  -4.927818 1.887277 0.642719
H  -0.905043 -1.833308 -1.734984
H  -0.933327 -1.095341 -3.383021
H  -2.484808 -1.533934 -2.566196
