program: Gaussian 09
title: 000052980
version: EM64L-G09RevD.01
frameworkgroup: C1[X(C14H22N2O2)]
method: RPBEPBE
basis: SDD
operation: Freq
keyword: #p
keyword: freq=noraman
keyword: PBEPBE/SDD
title: #p freq=noraman PBEPBE/SDD
converged: YES YES NO NO
title: Mulliken charges:
elementType: O O N N C C C C C C C C C C C C C C H H H H H H H H H H H H H H H H H H H H H H
charge: -0.306916 -0.276408 -0.344535 -0.685225 0.016482 -0.402918 -0.405997 0.035642 -0.692265 -0.709398 -0.691293 0.171755 0.223571 -0.336901 -0.329487 -0.407335 -0.401019 0.499817 0.176013 0.203189 0.239375 0.253123 0.194845 0.210975 0.222973 0.202495 0.219981 0.211518 0.222794 0.212669 0.240418 0.205237 0.215299 0.220605 0.265006 0.266228 0.220353 0.218936 0.310060 0.310342
chargesum: 0.00000
title: Mulliken charges with hydrogens summed into heavy atoms:
elementType: O O N N C C C C C C C C C C C C C C
charge: -0.306916 -0.276408 -0.091412 -0.064823 0.192494 0.039645 -0.000178 0.258615 -0.058271 -0.033517 -0.050153 0.171755 0.223571 -0.071895 -0.063260 -0.186982 -0.182083 0.499817
polarizability: 2.73303103e+02 1.88121734e+00 1.66568555e+02 -2.44102442e+01 9.61319096e+00 1.19563548e+02
1716.lowfreq: -9.2076 -4.5738 -0.0001 0.0006 0.0009 3.3632 17.6978 21.1408 22.8202
frequency: 17.6417 20.9732 22.7123 44.8747 79.3872 80.0857 90.7310 101.8183 115.3259 149.2771 187.8270 204.0358 221.4512 226.3320 250.0102 277.1711 282.7002 297.7410 359.5653 364.8084 378.8562 400.2153 406.9067 410.3790 415.4856 433.4973 474.3425 487.6070 508.5968 535.9385 609.3511 634.1188 672.4593 676.4800 754.6408 765.2808 775.9686 812.8035 822.1428 825.0426 837.9619 843.5095 893.7085 916.3034 931.2692 962.2875 974.4378 983.6412 996.8166 1006.1211 1017.4201 1035.6706 1046.5510 1056.5930 1085.9667 1107.9519 1130.0754 1135.5718 1152.1235 1175.3179 1179.9647 1183.2878 1232.8265 1251.1812 1261.1145 1295.7444 1306.1449 1308.9644 1324.3190 1330.9467 1344.0233 1349.8172 1371.9851 1382.3069 1385.1637 1391.6098 1395.0460 1447.1888 1453.4861 1454.3876 1464.1299 1467.3280 1472.9069 1476.8609 1479.8075 1486.6579 1491.7129 1516.3918 1569.3931 1606.0566 1631.7078 1645.7689 2842.4200 2913.6597 2975.4043 2977.8044 2981.6213 2990.3239 3011.5442 3033.2202 3043.2315 3068.2838 3073.6832 3075.0330 3083.3202 3090.7521 3101.5276 3123.3486 3126.2008 3158.4221 3175.0993 3436.1489 3561.0870 3701.0731
redmass: 3.0530 5.1789 3.8982 3.2908 4.4812 2.9473 2.2377 3.1187 4.0162 2.6979 2.5396 1.1586 1.2730 1.2839 3.7058 2.5585 4.6829 3.3822 3.7042 3.4451 2.7502 3.2536 1.2205 1.1680 2.2418 2.6291 3.0777 2.5247 2.8751 3.6199 6.2725 6.8804 1.4416 4.0217 4.4730 1.3376 5.8988 2.1416 3.1066 1.2642 3.5348 1.8529 1.9940 2.4293 1.4008 1.1968 1.3600 1.3490 3.2927 1.4188 1.4817 2.6534 2.8963 2.8093 2.3065 2.1405 1.2154 2.2329 2.0720 2.3329 1.1678 2.0261 1.2669 2.5097 1.2239 1.2239 1.3383 1.2971 2.4174 1.6188 1.4020 1.5104 1.3718 1.2262 1.2818 4.7857 1.2180 4.2233 1.1687 1.0739 1.0579 1.0678 1.0569 1.0606 1.0635 1.0693 1.0718 3.2040 7.3539 9.8371 3.2500 1.4332 1.0816 1.0694 1.0362 1.0442 1.0510 1.0356 1.0847 1.1003 1.0914 1.0995 1.0995 1.0988 1.1001 1.0994 1.1000 1.0894 1.0892 1.0954 1.0946 1.0732 1.0450 1.1040
irintensity: 0.2436 2.4848 0.6602 0.7681 0.1069 2.1715 0.5259 1.2283 0.8853 2.5060 1.4381 0.4403 0.4925 0.0999 3.6451 2.9132 6.1604 1.4763 5.6871 4.2556 12.9417 1.2996 262.6930 47.3411 0.7808 5.5762 2.5360 17.7254 2.0958 3.3700 10.5921 1.7720 64.0851 24.7452 12.0837 12.2965 15.2722 1.5160 1.8098 0.5621 12.0823 70.5937 0.9005 6.2341 1.2653 14.0065 0.2185 0.1141 44.8190 16.3982 14.0358 2.8414 407.7365 83.0735 58.8204 2.7129 14.9940 68.6715 12.5170 33.6209 164.8139 5.7668 0.9016 322.2576 5.5142 4.5548 6.4724 4.2539 61.8822 122.4386 0.6854 13.7088 11.0835 27.6334 14.6608 11.7486 19.3915 6.8536 32.3462 3.6026 17.1695 3.9741 8.9585 2.6196 19.1299 9.2436 19.8674 74.1651 39.9145 321.3013 107.2842 333.6115 81.4923 78.1504 35.1112 13.7867 41.3249 20.6910 10.6109 5.9538 23.8648 43.4806 58.6129 76.0304 47.3301 36.8548 19.2177 16.1147 23.2849 9.5433 3.7317 2.0083 112.2765 22.8980
temp: 298.150 k
press: 1.00000 atm
elementType: 8 8 7 7 6 6 6 6 6 6 6 6 6 6 6 6 6 6 1 1 1 1 1 1 1 1 1 1 1 1 1 1 1 1 1 1 1 1 1 1
symmnumber: 1
zpe: 891130.1 jmol-1
zpe.correction: 0.339414 hartree
zpe.thermalcorrener: 0.359593 hartree
zpe.thermalcorrenthalpy: 0.360537 hartree
zpe.thermalcorrgfe: 0.288106 hartree
zpe.sumelectzpe: -805.261539 hartree
zpe.sumelectthermal: -805.241359 hartree
zpe.sumelectthermalent: -805.240415 hartree
zpe.sumelectthermalfe: -805.312847 hartree
dipole: 3.3638 -0.8896 -2.0025
dipole: 4.0145
quadrupole: -62.8851 -107.3908 -111.7008
quadrupole: -2.8209 -7.1592 0.2035
quadrupole: 31.1071 -13.3985 -17.7086 -2.8209 -7.1592 0.2035
hfenergy: -805.6009523 hartree
pointgroup: C01 [X(C14H22N2O2)]
dipole: -1.3635907 0.7736087 0.191811 debye
polarizability: 275.2179528|-16.3133639|122.7855463|5.9349018|17.8133499|161.4317068 unknown
InChI: InChI=1S/C14H22N2O2/c1-4-10(2)16-9-11(3)18-14(17)12-5-7-13(15)8-6-12/h5-8,10-11,16H,4,9,15H2,1-3H3
charge 0 multiplicity 1
40 atoms
O  -0.223913 -0.385369 0.94788
O  -0.326264 -1.244584 -1.226923
N  3.437245 0.065514 0.182261
N  -6.461441 0.652508 -0.15343
C  4.398281 1.170351 -0.088609
C  2.022549 0.456767 0.362272
C  5.700676 0.585016 -0.691508
C  1.237694 -0.715325 0.994961
C  4.70693 1.944977 1.211904
C  1.581858 -0.960479 2.46218
C  5.545693 -0.001881 -2.113041
C  -0.900575 -0.70175 -0.243409
C  -2.333159 -0.335814 -0.184166
C  -3.151528 -0.603287 -1.315646
C  -2.923132 0.270756 0.95842
C  -4.515196 -0.279419 -1.312531
C  -4.286822 0.599398 0.972727
C  -5.108742 0.329286 -0.164186
H  3.976129 1.893117 -0.834389
H  1.971511 1.325669 1.043018
H  1.52434 0.748446 -0.590969
H  3.512262 -0.670294 -0.533784
H  6.457691 1.392643 -0.717349
H  6.083365 -0.191039 0.001644
H  1.390908 -1.624561 0.381691
H  5.372062 2.80397 1.003834
H  5.202756 1.276836 1.939083
H  3.788789 2.338708 1.683643
H  1.069281 -1.858124 2.848396
H  1.284498 -0.093931 3.079967
H  2.673687 -1.097157 2.549113
H  4.869606 -0.877358 -2.139469
H  5.139973 0.754402 -2.811094
H  6.521822 -0.338146 -2.507915
H  -2.689487 -1.07123 -2.191526
H  -2.296106 0.47669 1.830471
H  -5.133468 -0.492847 -2.19295
H  -4.729586 1.066505 1.860948
H  -6.888496 1.083991 0.661308
H  -7.049891 0.46024 -0.959126
