program: Gaussian 09
title: 000053022
version: EM64L-G09RevD.01
frameworkgroup: C1[X(C17H26O5)]
method: RPBEPBE
basis: SDD
operation: Freq
keyword: #pfreq=noraman
keyword: PBEPBE/SDD
title: #p freq=noraman PBEPBE/SDD
converged: YES YES NO NO
title: Mulliken charges:
elementType: O O O O O C C C C C C C C C C C C C C C C C H H H H H H H H H H H H H H H H H H H H H H H H H H
charge: -0.235254 -0.222524 -0.296089 -0.255365 -0.214295 0.363779 -0.066912 -0.077893 -0.558421 -0.207072 -0.116086 -0.470743 -0.160782 -0.535458 -0.815414 -0.000671 -0.772054 0.314061 0.080294 -0.700361 -0.507034 -0.507263 0.224715 0.217304 0.231933 0.227303 0.282529 0.245492 0.228593 0.220974 0.225992 0.235222 0.225191 0.226054 0.254067 0.219422 0.198160 0.225908 0.223374 0.216082 0.233263 0.257202 0.231557 0.209801 0.231663 0.234378 0.239573 0.195804
chargesum: 0.00000
title: Mulliken charges with hydrogens summed into heavy atoms:
elementType: O O O O O C C C C C C C C C C C C C C C C C
charge: -0.235254 -0.222524 -0.296089 -0.255365 -0.214295 0.363779 0.157803 0.139411 -0.099185 0.075457 0.129406 -0.021176 0.065210 -0.075045 -0.115870 0.197489 -0.106690 0.314061 0.080294 -0.209896 0.165986 0.162493
polarizability: 2.29179815e+02 -1.05987483e+01 2.04223154e+02 3.60358918e+00 1.35968963e+00 1.46792297e+02
1716.lowfreq: -12.4865 0.0008 0.0008 0.0010 7.7305 15.5419 32.3996 42.6027 75.6005
frequency: 31.7980 42.5117 75.5531 79.4863 86.1654 90.1429 118.6828 131.9393 138.3432 159.4452 163.7983 173.3886 176.5750 196.0743 212.0804 221.6305 226.9722 261.5426 282.0051 287.2741 294.8396 319.1776 336.1439 348.5114 372.1024 391.4676 402.8701 430.1123 456.5800 474.8509 488.2539 495.5221 540.0357 574.0637 588.3222 606.1836 611.4689 651.3853 685.3838 696.9244 727.9447 760.0831 778.9388 787.0391 809.1216 848.7300 886.3612 892.2940 905.4143 919.0776 939.1016 945.3069 949.9762 950.9961 966.9495 977.0431 981.8199 997.0801 1021.6561 1035.2147 1037.4723 1047.5610 1059.6170 1067.8601 1097.2659 1110.1769 1114.0246 1115.0620 1119.1066 1133.9189 1140.3890 1153.9586 1170.2819 1178.1860 1184.2127 1211.3515 1223.3706 1232.0396 1244.1418 1253.4499 1270.4408 1276.2514 1297.5323 1306.9171 1313.2705 1318.8388 1322.7825 1326.5267 1333.8936 1343.1780 1350.8571 1351.3122 1366.5366 1371.5936 1392.6857 1394.5212 1414.9802 1428.2827 1431.8438 1453.8120 1455.3391 1457.7111 1463.2296 1472.7284 1478.2575 1478.8710 1479.2480 1484.7399 1492.2999 1500.9034 1669.1949 1680.3330 2921.9412 2951.5044 2953.7137 2958.6683 2967.9581 2976.6017 2979.7676 2983.8077 2988.8881 3009.0997 3012.6155 3015.8831 3033.4075 3044.9098 3049.5671 3058.4527 3062.3384 3068.5093 3069.6929 3076.5342 3084.5657 3095.2966 3099.3745 3111.6171 3120.0992 3205.3671
redmass: 5.0944 4.2662 4.2338 3.1700 2.6906 5.5996 1.7283 1.7816 2.4840 1.7101 2.3015 1.1896 3.2065 2.6585 2.5597 2.2697 1.7110 3.1985 2.9698 3.0977 3.0159 3.3302 3.1777 4.2258 2.8614 4.6222 3.9156 3.6482 3.5649 3.1176 3.0448 3.3358 2.6037 3.8000 3.0776 3.1181 4.6003 2.3018 5.3941 3.3869 3.0812 3.2730 3.7308 2.4115 2.8513 2.6358 3.7953 2.7450 2.4531 4.1065 2.4919 2.1908 1.8173 2.0714 3.9099 1.7909 1.5550 1.9889 1.8059 2.6069 5.6786 4.3216 2.6450 2.7728 2.0602 1.9849 1.4240 1.3101 1.8819 1.6375 2.3008 1.8413 2.2007 2.0321 2.4986 1.5241 1.5199 2.1771 1.4364 1.4686 1.6158 1.2545 1.3190 1.3823 1.3278 1.3255 1.1472 1.2385 1.3414 1.3358 1.4218 1.3840 1.5050 1.4892 1.1959 1.1974 1.1735 1.1435 1.1694 1.0526 1.0518 1.0865 1.0796 1.0519 1.0546 1.0528 1.0528 1.0557 1.0560 1.0692 6.8660 11.1736 1.0837 1.0381 1.0351 1.0806 1.0845 1.0671 1.0527 1.0419 1.0567 1.0643 1.0835 1.0601 1.0971 1.1003 1.0906 1.0947 1.0997 1.0983 1.0970 1.1009 1.0974 1.0613 1.0990 1.1010 1.1023 1.1156
irintensity: 3.5111 0.5078 0.3451 1.1567 2.0183 1.1874 5.2312 3.0471 1.3604 1.8860 5.5489 0.5727 0.8349 0.5382 6.2780 0.5619 1.7603 2.3203 3.1702 4.7557 1.0696 1.1816 5.1651 2.2305 1.6718 0.6853 1.2651 1.1401 0.6403 5.1538 2.6599 3.6639 7.1000 4.2683 7.4179 3.1636 4.0185 14.0176 0.2480 0.1364 4.6650 1.2340 43.8382 9.9113 43.8805 12.3693 34.5637 18.0364 4.5886 141.6222 39.6971 3.1619 3.1917 41.1078 156.1105 22.0246 37.0426 8.1121 10.1443 40.9525 160.5037 169.6260 28.0726 19.2327 16.6230 1.5018 5.2400 3.2312 42.5838 1.4004 13.8612 29.6325 1.7039 21.8196 11.7295 2.9649 1.6856 62.3723 0.4321 15.3805 21.0649 0.5036 8.4332 6.5791 2.4360 8.1836 9.9170 7.8576 0.2164 3.3457 0.3516 2.3074 12.4147 43.2892 31.6962 12.9732 21.7909 4.6198 13.2564 8.3530 12.6176 10.0242 3.7397 6.9522 10.2058 17.4871 5.1156 12.7707 8.5944 24.0774 51.7530 273.4204 41.6168 57.1201 78.5293 3.5261 43.8063 14.3379 42.4860 9.4644 41.8992 17.5707 20.7065 21.7725 24.9014 45.1312 9.7587 40.8488 35.1038 33.1057 46.1859 27.9042 39.6417 4.8024 21.8670 21.9436 27.5153 3.9409
temp: 298.150 k
press: 1.00000 atm
elementType: 8 8 8 8 8 6 6 6 6 6 6 6 6 6 6 6 6 6 6 6 6 6 1 1 1 1 1 1 1 1 1 1 1 1 1 1 1 1 1 1 1 1 1 1 1 1 1 1
symmnumber: 1
zpe: 1064510.7 jmol-1
zpe.correction: 0.405451 hartree
zpe.thermalcorrener: 0.427852 hartree
zpe.thermalcorrenthalpy: 0.428796 hartree
zpe.thermalcorrgfe: 0.355184 hartree
zpe.sumelectzpe: -1037.754572 hartree
zpe.sumelectthermal: -1037.732170 hartree
zpe.sumelectthermalent: -1037.731226 hartree
zpe.sumelectthermalfe: -1037.804839 hartree
dipole: -5.9700 -2.0505 -1.3798
dipole: 6.4614
quadrupole: -172.4666 -120.6796 -129.4673
quadrupole: 5.1677 4.0705 1.6412
quadrupole: -31.5954 20.1916 11.4039 5.1677 4.0705 1.6412
hfenergy: -1038.1600228 hartree
pointgroup: C01 [X(C17H26O5)]
dipole: 2.3617324 -0.7781833 0.5281169 debye
polarizability: 228.945873|10.8959536|204.500349|3.1898294|-1.2485803|146.7490443 unknown
InChI: InChI=1S/C17H26O5/c1-9-6-13-11(10(2)15(18)21-13)8-17(3)12(9)7-14(19-4)22-16(17)20-5/h9,11-14,16H,2,6-8H2,1,3-5H3
charge 0 multiplicity 1
48 atoms
O  2.961804 -0.795146 -0.663263
O  -3.669024 0.950702 0.226339
O  1.172338 -1.830187 0.578926
O  4.58665 0.678758 0.205578
O  -5.33474 -0.659549 -0.016635
C  0.573991 -0.032621 -0.971781
C  0.817328 1.075993 0.122128
C  -0.070884 2.359273 0.007696
C  -0.874045 -0.645658 -0.96572
C  -1.677837 -0.481057 0.350281
C  -2.19837 0.980494 0.56768
C  -1.568015 2.070887 -0.305079
C  1.564405 -1.205196 -0.686334
C  2.321755 1.468134 0.15397
C  0.881472 0.476081 -2.406955
C  3.229616 0.260526 0.364206
C  0.041287 3.233013 1.286322
C  -2.959015 -1.299738 0.336123
C  -4.134453 -0.38229 0.164692
C  -3.111232 -2.643284 0.437143
C  1.89566 -3.079355 0.852442
C  5.571475 -0.372826 0.503752
H  0.588167 0.603618 1.100425
H  0.31413 2.965263 -0.839505
H  -0.79545 -1.729712 -1.175156
H  -1.460346 -0.222137 -1.802518
H  -1.030061 -0.794259 1.186006
H  -2.15285 1.250953 1.638854
H  -2.148436 3.00135 -0.159958
H  -1.698376 1.791193 -1.365494
H  1.524616 -1.952556 -1.507742
H  2.621489 1.963714 -0.787508
H  2.520228 2.178575 0.975114
H  0.281478 1.371545 -2.647341
H  1.948111 0.721432 -2.539596
H  0.625346 -0.301876 -3.151119
H  3.066765 -0.213432 1.360316
H  1.069793 3.592154 1.462088
H  -0.6058 4.124779 1.199727
H  -0.276029 2.673796 2.187139
H  -2.256029 -3.315962 0.567129
H  -4.113795 -3.084151 0.393979
H  2.986835 -2.905869 0.905008
H  1.687924 -3.835203 0.0676
H  1.522924 -3.440132 1.823754
H  6.55562 0.116614 0.448658
H  5.508942 -1.188273 -0.238138
H  5.415341 -0.783077 1.523664
