program: Gaussian 09
title: 000053009
version: EM64L-G09RevD.01
frameworkgroup: C1[X(C24H22)]
method: RPBEPBE
basis: SDD
operation: Freq
keyword: #p
keyword: freq=noraman
keyword: PBEPBE/SDD
title: #p freq=noraman PBEPBE/SDD
converged: YES YES NO NO
title: Mulliken charges:
elementType: C C C C C C C C C C C C C C C C C C C C C C C C H H H H H H H H H H H H H H H H H H H H H H
charge: -0.163624 -0.052422 0.074227 -0.483378 -0.559295 0.320060 0.244045 -0.761717 -0.765652 0.237085 -0.437139 -0.428415 0.213352 -0.494271 0.288416 -0.494200 0.148754 -0.401709 0.441690 -0.528406 -0.346425 -0.444595 -0.264861 -0.253547 0.204859 0.195476 0.214339 0.208804 0.221670 0.233367 0.242153 0.226813 0.215608 0.237871 0.213628 0.213315 0.230955 0.221008 0.240762 0.218793 0.220052 0.233703 0.221752 0.242298 0.226286 0.228514
chargesum: 0.00000
title: Mulliken charges with hydrogens summed into heavy atoms:
elementType: C C C C C C C C C C C C C C C C C C C C C C C C
charge: 0.041235 0.143054 0.074227 -0.060235 -0.104259 0.320060 0.244045 -0.077143 -0.100837 0.237085 -0.206184 -0.207407 0.213352 -0.253509 0.288416 -0.275407 0.148754 -0.181658 0.441690 -0.294702 -0.124673 -0.202297 -0.038575 -0.025033
polarizability: 4.66908802e+02 2.38514009e+01 2.63272154e+02 -4.73697140e+00 -1.29308738e+00 1.30967989e+02
1716.lowfreq: -4.7053 -0.0001 0.0006 0.0007 9.9286 10.8367 35.8395 44.9569 81.1524
frequency: 35.8202 44.8711 81.1518 92.8611 119.7161 121.8506 159.4609 180.9823 200.0917 212.9811 227.0119 235.9472 253.8714 264.6740 290.9718 309.5031 340.3347 373.2435 401.5515 423.0672 435.9502 458.9672 463.5468 479.7255 496.5627 509.8881 527.7810 530.7159 540.2783 562.6017 590.3943 606.9033 617.9615 647.8086 681.4748 705.4898 719.9781 754.1862 762.8509 766.1239 791.8032 803.3039 817.9837 826.8098 840.2185 854.8508 863.1841 869.8370 889.9540 893.3719 902.7958 951.3673 955.0659 965.4549 972.2193 973.2870 979.7660 990.8754 993.5977 1001.2738 1032.4055 1037.7768 1054.2304 1064.4995 1087.3916 1112.4009 1129.9947 1149.7938 1158.4285 1176.9428 1187.0897 1195.4670 1202.7133 1205.9897 1230.7710 1234.3250 1252.3351 1256.3897 1272.1428 1274.0949 1285.5573 1303.6333 1325.8605 1334.8931 1345.9917 1351.1066 1365.4177 1373.2518 1389.6435 1390.3373 1401.7786 1406.9358 1412.8837 1434.3267 1445.4167 1452.5507 1463.3938 1467.7162 1473.0603 1476.8965 1486.4578 1489.5853 1492.2128 1528.0184 1531.0374 1578.4959 1597.4333 1610.3260 1621.5847 1628.6284 2960.5883 2966.5553 2971.4195 2973.9805 2978.5008 2991.6251 3012.0229 3042.0427 3064.8809 3071.5003 3073.5799 3082.6260 3111.2826 3121.0911 3125.3114 3131.8868 3141.5159 3152.1637 3155.0130 3164.2610 3169.1322 3170.3449
redmass: 4.3939 3.8225 3.3228 3.4791 3.4137 4.2047 2.7876 1.7887 2.3530 2.2893 1.4303 2.0447 3.0234 4.2019 3.3419 2.8380 3.4205 2.5516 3.2774 3.6796 3.2024 3.4999 4.4053 3.9081 5.0856 4.8676 3.7768 3.1799 4.8043 4.6557 3.9365 3.5309 3.6871 5.3444 2.8552 3.4803 3.1687 1.6052 1.7417 2.8957 2.5200 2.1114 1.8512 2.0016 1.8672 3.6543 2.7938 3.5051 2.1862 3.0669 2.3143 1.5039 1.5026 1.5268 1.3762 1.9093 1.3884 1.3682 2.0225 1.5922 2.5131 1.9732 2.6430 2.3077 2.2188 1.9148 2.0455 1.3496 1.2199 1.1010 1.7418 1.4320 1.4305 1.7497 2.0570 1.9203 1.7724 1.8813 1.5426 1.6222 1.3371 1.7920 1.8136 1.6725 2.3439 1.5664 1.6325 2.6041 1.2238 1.2598 3.3122 6.1635 2.9758 3.8389 2.4211 1.6351 1.5071 1.0673 1.0616 1.0641 2.0234 1.2506 1.0749 3.4917 4.5726 8.1671 6.6640 6.3027 6.4700 6.5730 1.0628 1.0807 1.0651 1.0504 1.0368 1.0690 1.0925 1.1024 1.0992 1.0993 1.0989 1.0989 1.0885 1.0863 1.0881 1.0884 1.0880 1.0923 1.0960 1.0989 1.0924 1.0945
irintensity: 0.3050 0.0014 0.3333 0.0364 0.1470 0.1463 0.1886 0.4493 0.7223 0.6488 1.7205 1.0034 1.5379 0.0736 1.7503 1.1926 2.9084 0.7130 4.1916 2.7032 1.2451 1.6534 0.8382 6.4490 3.3862 4.4139 1.3014 2.9031 5.0487 1.3419 0.9947 0.7986 1.7915 4.6148 0.5208 0.5644 4.4680 8.1943 45.6203 9.7103 11.2111 3.4249 35.9330 49.8657 27.6914 5.9635 2.3533 1.3990 8.9849 3.8734 2.5510 0.1938 2.6770 0.4192 0.1974 2.6198 1.6347 0.5701 7.8307 8.2186 1.1415 14.0410 2.1934 12.4111 1.6118 2.5839 3.2442 1.3477 1.6620 2.0279 1.1249 2.6902 1.0133 1.2526 7.2005 3.1600 11.5667 1.5687 2.1764 16.1127 0.9287 2.3028 4.5648 2.5867 1.8132 3.3809 2.5585 1.9691 3.4914 30.0155 3.9949 1.9435 4.8966 7.0788 21.3269 5.4501 7.0054 2.8065 16.9566 10.5736 12.5101 2.8214 8.3123 2.1850 4.4023 1.0669 10.1963 1.8657 6.4006 0.9389 24.9435 14.6342 18.2656 46.1242 30.4629 89.1362 48.8790 50.8372 34.1986 23.7178 79.0130 33.1112 19.2144 1.5764 9.7172 10.4206 8.0426 22.9245 0.2496 27.1383 62.2911 12.2541
temp: 298.150 k
press: 1.00000 atm
elementType: 6 6 6 6 6 6 6 6 6 6 6 6 6 6 6 6 6 6 6 6 6 6 6 6 1 1 1 1 1 1 1 1 1 1 1 1 1 1 1 1 1 1 1 1 1 1
symmnumber: 1
zpe: 1009511.3 jmol-1
zpe.correction: 0.384503 hartree
zpe.thermalcorrener: 0.403544 hartree
zpe.thermalcorrenthalpy: 0.404489 hartree
zpe.thermalcorrgfe: 0.338239 hartree
zpe.sumelectzpe: -926.144770 hartree
zpe.sumelectthermal: -926.125728 hartree
zpe.sumelectthermalent: -926.124784 hartree
zpe.sumelectthermalfe: -926.191033 hartree
dipole: 1.1703 -0.1820 -0.0274
dipole: 1.1847
quadrupole: -122.4353 -126.1103 -149.7890
quadrupole: -0.0433 -0.4866 -0.5848
quadrupole: 10.3429 6.6679 -17.0108 -0.0433 -0.4866 -0.5848
hfenergy: -926.5292723 hartree
pointgroup: C01 [X(C24H22)]
dipole: -0.459797 0.0757464 -0.0098678 debye
polarizability: 467.3740855|21.9989054|262.8458264|2.8046086|-1.0392087|130.9290325 unknown
InChI: InChI=1S/C24H22/c1-15-7-8-18-10-12-22-21-11-9-17-5-3-4-6-19(17)20(21)13-14-23(22)24(18)16(15)2/h3-6,9-16H,7-8H2,1-2H3
charge 0 multiplicity 1
46 atoms
C  -3.3908 1.412611 -0.152387
C  -4.856081 1.197466 0.334348
C  -2.550369 0.129015 -0.07488
C  -5.474303 -0.037381 -0.366124
C  -4.684135 -1.319459 -0.035982
C  -3.17038 -1.137329 -0.070887
C  -1.104016 0.209642 -0.044025
C  -3.35533 2.007174 -1.590998
C  -4.933676 1.092443 1.876396
C  -0.292851 -0.986424 -0.034946
C  -2.35828 -2.313156 -0.058817
C  -0.966773 -2.248242 -0.04704
C  1.166556 -0.88712 -0.010895
C  -0.419952 1.48002 -0.015752
C  1.799969 0.398793 0.010291
C  0.961983 1.568914 0.013694
C  3.258695 0.501304 0.032162
C  2.00054 -2.066148 -0.008408
C  4.050303 -0.705847 0.033075
C  3.381882 -1.980781 0.012581
C  3.953966 1.752763 0.051237
C  5.478094 -0.625212 0.053388
C  5.353171 1.81086 0.070899
C  6.127059 0.613001 0.072204
H  -2.943244 2.166144 0.527449
H  -5.436542 2.092124 0.026418
H  -5.477845 0.125537 -1.461001
H  -6.531077 -0.158171 -0.059346
H  -4.972152 -2.132224 -0.731213
H  -4.96593 -1.679956 0.975344
H  -2.319935 2.177736 -1.933871
H  -3.830427 1.322339 -2.315802
H  -3.89483 2.972536 -1.624533
H  -4.298012 0.27553 2.263786
H  -4.591032 2.030747 2.351297
H  -5.971588 0.904748 2.210243
H  -2.85457 -3.292092 -0.061283
H  -0.39804 -3.181693 -0.046237
H  -1.003262 2.404803 -0.007728
H  1.419423 2.561927 0.041729
H  1.538146 -3.0565 -0.024347
H  3.992032 -2.891959 0.013035
H  3.392966 2.691741 0.049826
H  6.05766 -1.556174 0.053606
H  5.857723 2.783317 0.085118
H  7.220965 0.667534 0.087374
