program: Gaussian 09
title: 000052946
version: EM64L-G09RevD.01
frameworkgroup: C1[X(C14H16N2O3)]
method: RPBEPBE
basis: SDD
operation: Freq
keyword: #p
keyword: freq=noraman
keyword: PBEPBE/SDD
title: #p freq=noraman PBEPBE/SDD
converged: YES YES NO NO
title: Mulliken charges:
elementType: O O O N N C C C C C C C C C C C C C C H H H H H H H H H H H H H H H H
charge: -0.273048 -0.201949 -0.205413 -0.223326 -0.125012 -0.488844 0.186234 0.185603 0.275576 0.105180 0.108816 -0.347681 -0.379634 -0.355073 -0.355147 -0.658405 -0.645663 -0.212653 -0.212330 0.270057 0.262430 0.262454 0.204165 0.237916 0.226190 0.268243 0.267871 0.217998 0.253206 0.203458 0.219119 0.234068 0.221592 0.237049 0.236955
chargesum: 0.00000
title: Mulliken charges with hydrogens summed into heavy atoms:
elementType: O O O N N C C C C C C C C C C C C C C
charge: -0.273048 -0.201949 -0.205413 -0.223326 -0.125012 0.043643 0.186234 0.185603 0.275576 0.105180 0.108816 0.118937 0.084471 -0.086830 -0.087276 0.016258 0.029116 0.024396 0.024625
polarizability: 2.37056415e+02 1.23579999e+01 1.63810077e+02 2.19235221e+01 -1.72368325e+01 1.23512473e+02
1716.lowfreq: -10.9883 -4.1081 0.0006 0.0006 0.0009 6.5597 19.8523 27.7627 35.8694
frequency: 18.9999 27.5461 35.8013 63.0748 73.9983 92.4211 121.4295 133.5280 140.2869 179.7629 188.8988 214.7891 232.2881 243.5979 263.6641 314.3660 322.8593 346.7692 366.3488 415.8110 424.1514 456.0414 469.9408 524.1463 534.0507 563.5173 587.4300 613.6954 658.1107 683.7251 702.2878 706.6436 764.7851 779.3785 787.4143 788.0429 802.6439 834.2663 888.5606 905.8502 938.5878 946.8517 972.9243 978.8468 1005.1153 1015.7700 1024.8167 1070.3761 1072.9870 1080.5276 1089.1696 1097.4185 1138.4199 1168.9694 1172.8711 1209.5239 1214.1602 1252.5652 1284.0258 1297.1384 1313.9346 1322.3205 1342.6670 1358.3105 1370.6490 1386.7599 1391.4755 1407.4815 1416.6837 1434.6940 1453.9412 1454.9464 1458.1634 1468.0637 1470.8548 1479.6520 1482.8137 1494.9786 1607.2303 1614.7823 1620.7296 1634.0226 1683.2050 2984.6199 2985.3595 3002.8137 3007.3063 3011.8227 3057.2152 3068.3944 3080.9717 3084.7615 3085.5489 3091.8234 3102.5883 3138.2184 3152.3947 3164.6152 3174.0677
redmass: 4.6687 4.4331 5.1969 2.7847 3.1423 6.2087 6.6983 3.4828 5.0943 3.2866 2.2763 1.1425 4.2223 1.5640 2.6219 2.9629 4.7074 4.7015 4.6318 3.2624 2.8874 4.8795 3.3415 7.1760 5.0917 3.9118 4.0970 5.9746 4.8263 6.9435 5.4298 3.2770 2.0310 1.1487 5.0024 1.4169 2.2066 4.7825 2.6142 1.4059 2.2513 3.1441 1.4154 5.3065 1.3467 2.3513 2.3518 2.0824 2.5283 1.8581 2.7849 1.7666 2.0739 1.1562 2.0228 3.1495 2.9633 1.4566 1.4849 1.3411 1.4019 1.3878 1.2647 1.2925 6.7636 1.2211 1.2120 1.8981 5.1731 1.3744 2.4786 2.7441 1.1117 1.0448 1.0429 1.0570 1.0567 1.1006 7.2316 7.6903 7.8139 12.0163 11.8856 1.0360 1.0356 1.0631 1.0631 1.0592 1.0997 1.0993 1.1023 1.0994 1.0988 1.1018 1.1020 1.0864 1.0906 1.0956 1.1003
irintensity: 1.0421 1.3150 3.4245 1.8586 1.7094 1.1008 2.0499 0.6720 0.0303 1.5902 0.2965 0.3177 0.5701 1.4273 5.3368 4.4027 9.0878 4.3326 14.7306 4.6351 4.7830 0.0728 6.2667 7.0325 18.3487 5.3908 10.5693 15.1262 0.0012 0.2119 0.3972 64.8175 35.1366 3.9805 0.5057 33.0474 4.5172 1.5118 7.0422 0.0247 19.7974 51.9230 1.9177 13.8010 0.0049 0.6519 0.5564 23.6465 14.6109 7.4835 27.4507 18.1353 64.5952 11.6455 5.8454 43.9959 25.0736 98.2386 0.1027 22.6603 18.1043 17.8147 1.5126 12.3016 285.1297 13.5199 25.8258 48.8081 2.1282 132.4391 11.5965 3.0622 15.8185 5.8859 14.6912 6.9423 10.3659 8.3414 270.6658 4.9920 57.1973 394.4477 33.6860 27.1512 20.5128 37.4711 28.8668 28.0548 5.8501 10.1455 0.7249 41.1184 38.1373 42.8693 31.3777 1.9208 6.5258 6.6492 22.3790
temp: 298.150 k
press: 1.00000 atm
elementType: 8 8 8 7 7 6 6 6 6 6 6 6 6 6 6 6 6 6 6 1 1 1 1 1 1 1 1 1 1 1 1 1 1 1 1
symmnumber: 1
zpe: 730696.2 jmol-1
zpe.correction: 0.278307 hartree
zpe.thermalcorrener: 0.296588 hartree
zpe.thermalcorrenthalpy: 0.297532 hartree
zpe.thermalcorrgfe: 0.229845 hartree
zpe.sumelectzpe: -876.912734 hartree
zpe.sumelectthermal: -876.894454 hartree
zpe.sumelectthermalent: -876.893510 hartree
zpe.sumelectthermalfe: -876.961197 hartree
dipole: 1.0872 1.1419 1.2058
dipole: 1.9850
quadrupole: -69.8112 -120.0003 -113.8289
quadrupole: 2.8353 7.0815 3.1551
quadrupole: 31.4023 -18.7869 -12.6154 2.8353 7.0815 3.1551
hfenergy: -877.191042 hartree
pointgroup: C01 [X(C14H16N2O3)]
dipole: -0.4171349 0.4251511 -0.505089 debye
polarizability: 236.2853595|-12.0822339|166.0599806|23.9733411|14.2382949|122.0336248 unknown
InChI: InChI=1S/C14H16N2O3/c1-3-15(4-2)12(17)9-16-13(18)10-7-5-6-8-11(10)14(16)19/h5-8H,3-4,9H2,1-2H3
charge 0 multiplicity 1
35 atoms
O  -1.375005 -0.704657 1.182091
O  0.728047 -2.047787 -1.55166
O  0.495261 2.313378 0.198087
N  0.297085 0.163009 -0.791658
N  -3.319919 -0.046438 0.081406
C  -1.123732 0.210594 -1.088061
C  2.430639 -0.658336 -0.368627
C  2.361651 0.655834 0.15601
C  -1.948824 -0.216706 0.161373
C  1.102646 -0.999506 -0.972534
C  0.986634 1.1954 -0.093866
C  -4.146424 -0.454912 1.245498
C  -4.020486 0.550647 -1.078909
C  3.604248 -1.420959 -0.279732
C  3.464169 1.250721 0.786402
C  -4.646609 -1.909926 1.128553
C  -4.237015 2.075207 -0.940269
C  4.725149 -0.829238 0.359146
C  4.656081 0.486318 0.884119
H  -1.318194 -0.48844 -1.922302
H  -1.383937 1.235972 -1.401938
H  -3.522962 -0.347045 2.14887
H  -4.997668 0.247354 1.324484
H  -3.464626 0.327752 -2.006011
H  -4.997951 0.041774 -1.1775
H  3.64477 -2.43594 -0.687084
H  3.398326 2.26602 1.18968
H  -5.270688 -2.171331 2.002798
H  -3.789785 -2.603891 1.095219
H  -5.255569 -2.059603 0.217671
H  -4.790506 2.466698 -1.813553
H  -3.274419 2.611913 -0.869768
H  -4.819857 2.31092 -0.032106
H  5.658092 -1.395681 0.451285
H  5.536778 0.915683 1.373787
