program: Gaussian 09
title: 000053025
version: EM64L-G09RevD.01
frameworkgroup: C1[X(C17H17N7O8S4)]
method: RPBEPBE
basis: SDD
operation: Freq
keyword: #p
keyword: freq=noraman
keyword: PBEPBE/SDD
title: #p freq=noraman PBEPBE/SDD
converged: YES YES NO NO
title: Mulliken charges:
elementType: S S S S O O O O O O O O N N N N N N N C C C C C C C C C C C C C C C C C H H H H H H H H H H H H H H H H H
charge: 0.192929 0.331797 0.507957 0.437361 -0.233408 -0.133832 -0.392963 -0.177142 -0.239955 -0.492797 -0.303784 -0.257585 -0.159714 -0.432165 -0.161087 -0.165694 -0.034237 -0.088753 -0.633136 0.272143 -0.561209 0.156571 0.189209 0.441576 -0.833754 0.394259 -0.857296 0.123361 -0.529276 -0.945933 -0.709254 -0.053404 0.325336 0.204555 0.150033 -0.610047 0.328553 0.330681 0.366664 0.293316 0.311880 0.316470 0.243777 0.209425 0.261148 0.324000 0.395988 0.255254 0.270832 0.256836 0.333629 0.383136 0.397750
chargesum: 0.00000
title: Mulliken charges with hydrogens summed into heavy atoms:
elementType: S S S S O O O O O O O O N N N N N N N C C C C C C C C C C C C C C C C C
charge: 0.192929 0.331797 0.507957 0.437361 -0.233408 -0.133832 0.003025 -0.177142 -0.239955 -0.095047 -0.303784 -0.257585 -0.159714 -0.101483 -0.161087 -0.165694 -0.034237 -0.088753 0.083629 0.272143 -0.232656 0.156571 0.189209 0.441576 -0.173774 0.394259 -0.228946 0.123361 0.185074 -0.621933 -0.709254 -0.053404 0.325336 0.204555 0.150033 0.172875
polarizability: 4.82852669e+02 7.57912786e+00 3.23895625e+02 1.39579367e+01 -3.52423650e+01 2.89690749e+02
1716.lowfreq: -6.1094 -3.3930 -0.0006 -0.0003 0.0010 1.6219 6.5613 8.8015 12.8916
frequency: 6.3544 8.6669 12.8549 21.2220 26.9289 31.8218 41.4772 44.6914 58.8764 69.9181 73.8184 80.1462 86.3984 88.7897 92.0956 98.4165 100.1686 114.0201 124.2207 137.6952 141.3423 148.1867 153.4418 165.5958 181.7180 202.8415 209.6665 219.9095 226.3757 231.6707 251.8781 256.0665 263.2743 271.9919 285.4822 296.5331 320.2169 329.7491 342.2831 348.9351 364.1088 373.3974 375.7943 400.3029 414.9783 433.5539 451.6656 461.3363 476.1651 497.4585 503.1549 512.8677 519.2547 532.9350 543.8506 591.4116 593.0952 599.5349 600.3238 610.9757 615.5648 635.6861 641.1845 644.6268 669.7679 674.5755 677.4320 679.0209 693.1951 703.4181 708.9221 723.6886 735.0771 739.9603 750.7522 775.6887 798.2202 810.1920 835.7072 868.3238 872.1406 881.1862 886.8703 927.3906 931.0433 936.2571 965.7049 979.5665 991.5064 1014.4155 1034.9648 1054.5341 1065.0937 1069.6107 1092.3359 1100.4616 1113.0463 1114.2726 1120.2104 1126.1872 1136.4633 1150.3255 1158.6223 1165.4214 1171.4623 1184.8370 1197.0992 1202.4274 1225.2277 1243.2383 1248.7871 1253.9900 1301.7413 1309.2201 1310.0869 1311.3289 1383.2641 1391.2122 1408.3699 1431.5001 1435.6598 1444.8821 1451.0749 1451.3794 1467.7388 1471.2784 1473.6420 1478.4335 1479.6345 1565.8795 1601.3408 1605.4323 1616.5332 1620.6044 1632.6902 1743.9249 2967.9932 2968.3630 3004.9096 3033.4219 3059.7411 3067.2439 3075.7266 3078.4314 3094.9222 3132.2868 3140.0151 3144.6444 3443.5274 3464.9504 3533.5020 3540.3489 3651.6114
redmass: 9.0872 7.5445 8.6331 6.0610 7.7025 8.6673 9.3345 7.1889 4.3209 1.8821 5.1818 6.2872 2.7907 4.8880 5.3012 8.2747 7.9145 9.2860 6.7872 2.1123 9.6359 4.8660 3.2348 4.5411 5.2215 5.1481 6.1280 4.9191 7.2900 6.4801 6.9090 7.9321 8.7922 8.0430 8.7765 5.2637 9.3676 14.9400 5.6052 6.9190 3.4840 7.3067 5.4710 8.3769 4.7022 13.6249 8.3026 4.9171 4.6240 8.6385 5.8475 4.4532 3.9297 6.2170 1.2114 2.1873 4.7382 1.3207 1.3613 3.7406 3.7477 4.5757 6.6510 11.6401 4.7041 6.7009 8.8504 2.8550 5.7177 1.4009 6.1215 6.4637 7.3854 6.6646 6.2574 10.3691 6.5585 6.1269 10.2628 2.7053 2.9730 2.1609 8.9335 5.2204 7.1852 5.6009 5.9389 6.9278 13.0742 5.8400 1.7464 2.1831 2.6374 3.7311 1.8295 2.1619 1.5117 2.9817 2.4810 1.3301 10.2975 1.5118 1.9851 1.7053 1.4521 1.7482 3.3241 1.5033 1.3525 1.5483 1.8396 1.4050 1.8124 2.8150 4.3468 4.3952 3.3143 6.0562 4.0798 1.1477 1.1064 1.1346 1.4236 1.0800 1.0442 1.6111 1.0733 6.4540 1.0735 4.3096 1.7762 7.6145 4.1887 8.1549 6.9989 12.9164 1.0393 1.0574 1.0346 1.1019 1.0588 1.0872 1.0954 1.0915 1.1028 1.1022 1.1003 1.1080 1.0776 1.0494 1.0646 1.0644 1.1013
irintensity: 0.1114 0.3258 0.9496 4.4636 0.6812 4.4108 4.5326 4.4059 0.7142 0.1221 0.5792 1.2661 1.2861 6.3629 2.2782 5.6810 1.9530 6.3814 2.0043 2.3115 2.4332 1.0935 0.1335 3.7859 10.7683 0.3793 0.8772 3.4782 15.4936 13.8145 8.8565 27.1922 0.6629 5.2738 2.1011 8.6934 18.2893 2.5959 9.6067 9.0955 4.4359 2.2731 7.3532 14.7362 2.8775 4.0348 3.5584 13.6529 13.6923 18.7182 20.2544 23.1900 20.5076 3.7571 14.2095 104.5189 21.1507 24.7460 246.1991 54.0776 88.6775 41.5503 10.5730 0.0116 31.1588 8.4831 6.3645 61.9270 29.5612 100.5828 7.4038 14.6579 1.9535 2.6565 20.9436 38.1981 9.2882 15.8173 93.2695 21.3408 10.3109 10.2691 6.1520 46.3427 21.3217 7.9163 129.4267 38.7092 13.7505 221.8909 149.4096 121.3389 306.6365 82.4018 12.6662 26.8065 33.5700 7.9667 35.4806 0.5682 36.8071 37.7928 134.8876 61.7681 21.4593 94.1958 18.1689 20.2721 3.9081 34.1302 130.8839 41.4254 37.2226 36.3634 77.4755 51.1196 56.8079 257.0699 127.2352 36.7234 25.1805 38.9519 33.1749 27.7420 31.7295 915.5421 7.8700 26.1797 44.3631 500.2266 145.1439 197.4131 613.4819 49.2651 87.7948 446.9333 57.5227 51.7997 17.1820 49.7387 5.5477 4.2115 31.9777 12.0958 11.6861 17.9514 2.1118 0.2084 101.8040 129.7412 80.1988 85.4480 92.5657
temp: 298.150 k
press: 1.00000 atm
elementType: 16 16 16 16 8 8 8 8 8 8 8 8 7 7 7 7 7 7 7 6 6 6 6 6 6 6 6 6 6 6 6 6 6 6 6 6 1 1 1 1 1 1 1 1 1 1 1 1 1 1 1 1 1
symmnumber: 1
zpe: 925946.1 jmol-1
zpe.correction: 0.352674 hartree
zpe.thermalcorrener: 0.389653 hartree
zpe.thermalcorrenthalpy: 0.390597 hartree
zpe.thermalcorrgfe: 0.276246 hartree
zpe.sumelectzpe: -3232.566586 hartree
zpe.sumelectthermal: -3232.529607 hartree
zpe.sumelectthermalent: -3232.528663 hartree
zpe.sumelectthermalfe: -3232.643014 hartree
dipole: 1.8024 0.9183 -0.4831
dipole: 2.0797
quadrupole: -166.5511 -252.3675 -237.0173
quadrupole: -27.2643 19.5810 31.1164
quadrupole: 52.0942 -33.7222 -18.3720 -27.2643 19.5810 31.1164
hfenergy: -3232.91926 hartree
pointgroup: C01 [X(C17H17N7O8S4)]
dipole: -0.7219617 -0.1744386 -0.3432847 debye
polarizability: 483.7648781|0.5892348|284.4841227|-6.2806057|33.2898293|328.1900423 unknown
InChI: InChI=1S/C17H17N7O8S4/c1-23-16(20-21-22-23)34-4-5-3-33-15-17(32-2,14(31)24(15)7(5)11(29)30)19-9(26)13-35-12(36-13)6(8(18)25)10(27)28/h13,15,19,27,29H,3-4,18H2,1-2H3
charge 0 multiplicity 1
53 atoms
S  -1.296283 0.746747 -1.772403
S  -5.732276 -0.749223 0.39029
S  4.346857 -1.406571 1.399802
S  3.945164 -0.659274 -1.320953
O  1.022753 3.337094 0.484113
O  -0.641368 1.670954 2.767357
O  -3.244023 3.049632 2.696613
O  2.907286 1.33216 1.632339
O  -4.911105 1.459994 2.385088
O  8.665316 -2.452717 0.197377
O  6.008228 -0.936585 -2.747304
O  6.95794 -2.32687 1.764127
N  -1.790288 2.0644 0.643991
N  1.164289 0.925645 0.101579
N  -6.194344 -3.037601 -1.153985
N  -5.274149 -1.392696 -2.340422
N  -6.029174 -3.526912 -2.474941
N  -5.478825 -2.518856 -3.169425
N  8.163154 -1.690314 -2.331793
C  0.334604 2.097376 0.365076
C  -0.955311 2.172614 -0.569628
C  -0.697494 1.926743 1.562072
C  -3.163953 1.764972 0.692262
C  -3.831011 1.260364 -0.410321
C  -3.175787 0.998451 -1.753206
C  2.33715 0.590538 0.79309
C  -5.309493 0.975538 -0.391643
C  -3.867054 2.033964 1.984174
C  2.015478 3.619469 -0.574262
C  2.886523 -0.760429 0.349843
C  5.185573 -1.303748 -0.183903
C  -5.729367 -1.745191 -1.103254
C  6.495763 -1.631524 -0.507453
C  6.886937 -1.404365 -1.924995
C  7.333303 -2.146295 0.572016
C  -6.778267 -3.876147 -0.105953
H  -1.066163 3.130965 -1.09865
H  0.73737 0.211695 -0.501716
H  -3.60766 0.083043 -2.202651
H  -3.392492 1.832303 -2.447465
H  -5.730136 0.934817 -1.40795
H  -5.885537 1.658452 0.246914
H  2.286019 4.674628 -0.423662
H  1.585914 3.478133 -1.586166
H  2.908097 2.984179 -0.446733
H  2.122587 -1.546902 0.235761
H  -3.668449 3.150514 3.590648
H  -7.656413 -3.378076 0.339065
H  -7.088321 -4.822791 -0.5711
H  -6.037953 -4.082166 0.685769
H  8.403217 -1.522201 -3.307352
H  8.843949 -2.056076 -1.660946
H  9.146827 -2.78795 0.999374
