program: Gaussian 09
title: 000052944
version: EM64L-G09RevD.01
frameworkgroup: C1[X(C13H14N2O3)]
method: RPBEPBE
basis: SDD
operation: Freq
keyword: #p
keyword: freq=noraman
keyword: PBEPBE/SDD
title: #p freq=noraman PBEPBE/SDD
converged: YES YES NO NO
title: Mulliken charges:
elementType: O O O N N C C C C C C C C C C C C C H H H H H H H H H H H H H H
charge: -0.205493 -0.198827 -0.252853 -0.212445 -0.366981 -0.517330 0.188382 0.184840 0.120918 0.109032 0.283013 -0.369109 -0.353990 -0.352636 -0.340764 -0.210960 -0.211133 -0.687206 0.246026 0.279764 0.255944 0.207511 0.268304 0.269050 0.202036 0.238106 0.302777 0.237880 0.238139 0.202067 0.228836 0.217100
chargesum: 0.00000
title: Mulliken charges with hydrogens summed into heavy atoms:
elementType: O O O N N C C C C C C C C C C C C C
charge: -0.205493 -0.198827 -0.252853 -0.212445 -0.064204 0.008461 0.188382 0.184840 0.120918 0.109032 0.283013 0.094347 -0.085686 -0.083586 0.099378 0.026920 0.027006 -0.039203
polarizability: 2.18461568e+02 2.66380196e+00 1.64135525e+02 2.74920541e+01 -2.46252369e+00 1.04883435e+02
1716.lowfreq: -26.1184 -7.8567 -4.1966 -0.4810 -0.0007 -0.0004 0.0002 17.8428 36.0405
frequency: -24.4623 17.5140 35.8774 44.0100 73.4596 95.4694 126.6198 139.5713 179.3428 216.7588 221.4637 238.2419 249.5168 264.6671 319.8150 346.6800 363.4375 414.7509 447.1254 455.7772 514.8000 525.0130 548.2255 578.0568 604.1213 658.4818 673.4473 683.0451 703.5725 725.9353 766.1799 787.7131 797.3763 831.1709 844.7450 863.1445 906.6803 930.0850 939.7625 963.3695 974.1275 999.2101 1005.9587 1021.4470 1072.1494 1084.3521 1092.4519 1103.0455 1137.7502 1169.0075 1172.5556 1210.2741 1216.5486 1249.6545 1281.8167 1283.7356 1310.6788 1336.3160 1341.6169 1359.8999 1369.4166 1387.4549 1415.6832 1429.3220 1449.1524 1454.2096 1454.5089 1463.8129 1478.1210 1484.8254 1494.1493 1614.6369 1619.8882 1633.2599 1639.8047 1683.1655 2971.4628 2989.2212 2998.7737 3004.6101 3043.7351 3069.3578 3070.0128 3076.5344 3080.2104 3139.0817 3152.9460 3164.8417 3174.5671 3549.8588
redmass: 3.1517 5.7351 4.8504 6.0346 3.6379 2.6345 5.0214 5.1140 6.3695 2.0895 1.9583 3.5024 3.7778 2.7584 6.4491 8.3907 2.5317 3.2536 2.0168 4.8097 4.6750 6.5524 1.6065 2.8703 5.7087 4.8282 4.4989 6.7366 4.5456 2.5009 1.5234 5.1732 1.7511 3.9997 2.7281 2.1157 1.4048 2.1988 3.2546 3.8449 1.4143 2.3755 1.3472 1.9986 2.5447 2.7911 2.6782 2.1958 1.9966 1.1558 2.0229 3.1262 2.0389 1.2245 1.2392 1.4715 1.3962 1.5501 1.4272 1.2966 4.7358 1.2340 5.1798 1.1623 1.1143 2.7066 2.5287 1.0739 1.0548 1.1979 1.4890 7.6905 7.8017 11.6550 7.3951 11.7805 1.0365 1.0621 1.0640 1.0579 1.0978 1.1032 1.0999 1.0991 1.1015 1.0864 1.0906 1.0956 1.1004 1.0776
irintensity: 0.5595 2.4087 3.6736 6.0853 1.6807 1.9565 2.1478 0.0462 1.9805 0.7093 1.6308 0.3616 6.5000 6.4373 7.0658 14.6618 7.0094 2.9922 15.0025 0.3042 24.8065 18.9671 70.6808 4.6555 16.5848 0.0105 8.6637 0.8206 23.7706 54.5083 27.9259 0.1189 21.5317 2.7019 0.9800 7.3125 0.0204 13.5504 63.2118 10.4329 2.0066 8.8438 0.0036 0.6517 25.0477 28.8056 8.8395 0.5405 4.2448 10.7538 6.1958 56.2911 62.4567 17.8641 56.6580 2.2821 22.8244 27.5660 5.4612 8.4167 266.9903 21.4359 3.5220 52.3313 26.0970 4.3127 10.1771 8.5674 18.5004 50.3646 172.2767 0.6857 54.2546 339.9491 241.1570 38.8897 32.5093 26.7994 51.1149 25.7555 1.4453 4.3591 58.7645 48.7714 27.7865 1.8129 5.8137 6.2517 21.3905 18.4288
temp: 298.150 k
press: 1.00000 atm
elementType: 8 8 8 7 7 6 6 6 6 6 6 6 6 6 6 6 6 6 1 1 1 1 1 1 1 1 1 1 1 1 1 1
symmnumber: 1
zpe: 658390.2 jmol-1
zpe.correction: 0.250768 hartree
zpe.thermalcorrener: 0.266804 hartree
zpe.thermalcorrenthalpy: 0.267748 hartree
zpe.thermalcorrgfe: 0.205272 hartree
zpe.sumelectzpe: -837.696574 hartree
zpe.sumelectthermal: -837.680537 hartree
zpe.sumelectthermalent: -837.679593 hartree
zpe.sumelectthermalfe: -837.742069 hartree
dipole: -0.2722 1.1155 -1.8087
dipole: 2.1424
quadrupole: -69.2112 -111.9487 -106.9128
quadrupole: 9.5171 8.4030 5.4488
quadrupole: 26.8130 -15.9245 -10.8886 9.5171 8.4030 5.4488
hfenergy: -837.9473412 hartree
pointgroup: C01 [X(C13H14N2O3)]
dipole: -0.082089 -0.5491089 0.6341887 debye
polarizability: 218.1461213|4.1166013|163.7021342|-27.9630544|5.5836536|105.6322728 unknown
InChI: InChI=1S/C13H14N2O3/c1-2-7-14-11(16)8-15-12(17)9-5-3-4-6-10(9)13(15)18/h3-6,14H,2,7-8H2,1H3
charge 0 multiplicity 1
32 atoms
O  -0.065893 -1.889038 0.777805
O  1.15886 2.653578 0.677738
O  -1.682843 0.831777 -1.164897
N  0.244537 0.464217 0.852812
N  -3.402166 0.555578 0.386203
C  -1.107519 0.833142 1.236311
C  2.056765 -0.77199 0.083175
C  2.422056 0.59651 0.046951
C  0.650749 -0.875239 0.588135
C  1.263562 1.412149 0.533088
C  -2.079082 0.723833 0.030789
C  -4.475976 0.472367 -0.623322
C  2.949275 -1.777963 -0.314845
C  3.691009 1.003858 -0.389829
C  -4.785987 -0.975826 -1.072248
C  4.2356 -1.376136 -0.760311
C  4.600755 -0.006463 -0.79761
C  -5.31068 -1.878489 0.064301
H  -1.442619 0.194619 2.073694
H  -1.075247 1.886509 1.571902
H  -4.143068 1.066245 -1.492053
H  -5.384394 0.945781 -0.203549
H  2.655717 -2.831834 -0.28376
H  3.960585 2.064245 -0.415563
H  -5.537482 -0.922037 -1.884909
H  -3.869403 -1.410793 -1.512106
H  -3.636841 0.386273 1.365696
H  4.958411 -2.133339 -1.082564
H  5.599806 0.273438 -1.148545
H  -6.223121 -1.454473 0.526821
H  -5.564501 -2.884241 -0.315672
H  -4.550365 -2.01166 0.856562
