program: Gaussian 09
title: 000052961
version: EM64L-G09RevD.01
frameworkgroup: C1[X(C16H17NO)]
method: RPBEPBE
basis: SDD
operation: Freq
keyword: #p
keyword: freq=noraman
keyword: PBEPBE/SDD
title: #p freq=noraman PBEPBE/SDD
converged: YES YES NO NO
title: Mulliken charges:
elementType: O N C C C C C C C C C C C C C C C C H H H H H H H H H H H H H H H H H
charge: -0.313177 -0.311568 0.079112 0.308597 -0.492950 -0.543750 -0.441478 0.214402 -0.405897 0.202973 -0.422580 -0.251419 0.141820 -0.376353 -0.355432 -0.251887 -0.217847 -0.525865 0.235726 0.203624 0.249373 0.240467 0.216399 0.187899 0.267152 0.232255 0.250900 0.225900 0.250873 0.251140 0.227993 0.229010 0.217835 0.246867 0.229889
chargesum: 0.00000
title: Mulliken charges with hydrogens summed into heavy atoms:
elementType: O N C C C C C C C C C C C C C C C C
charge: -0.313177 -0.044416 0.079112 0.308597 -0.053600 -0.053910 -0.037181 0.214402 -0.173642 0.202973 -0.171680 -0.025519 0.141820 -0.125479 -0.104293 -0.023894 0.011162 0.168726
polarizability: 2.31138484e+02 1.12848953e+01 1.69576536e+02 1.75424654e+01 -4.77503522e+00 1.33506299e+02
1716.lowfreq: -13.5224 -8.4912 -7.5091 0.0006 0.0006 0.0007 39.2154 44.8300 60.6092
frequency: 38.7712 44.5186 60.5271 80.4352 101.7397 127.6686 128.6178 160.9008 221.1559 240.1232 256.1272 290.2095 314.0690 338.1356 386.1177 423.8648 436.1453 454.7378 485.7265 505.9024 543.2853 549.0873 571.4034 583.3204 603.1566 643.3195 719.6489 729.1339 744.4972 756.9261 773.4686 787.6171 799.5679 838.3603 873.3453 900.6894 910.0050 941.8597 949.3860 958.0073 969.8646 983.0156 988.0722 1015.7198 1035.8908 1053.0365 1066.4911 1088.7259 1107.8758 1118.8449 1150.0580 1151.7017 1166.2887 1176.9757 1187.8847 1194.2079 1201.4934 1211.7682 1236.5031 1253.1275 1262.2603 1289.1135 1304.7869 1340.0123 1356.1749 1362.2974 1388.1901 1415.3806 1434.1998 1438.1409 1442.7256 1449.2752 1453.7418 1458.9562 1471.6562 1472.1937 1477.0304 1483.8791 1570.0248 1592.7845 1596.6414 1605.7478 2854.5558 2881.1490 2965.8747 2976.2684 3017.2923 3030.0344 3043.6851 3062.3391 3112.7534 3116.6389 3126.2669 3128.0000 3137.2998 3153.0944 3153.9336 3167.9750 3462.7106
redmass: 2.6515 3.3026 3.6699 4.0441 2.6185 2.9489 1.7412 2.0955 3.7203 3.6816 5.0211 3.2298 2.1054 3.5487 3.9110 4.1569 4.4357 3.1186 4.5318 3.6217 3.4023 3.6944 2.2880 3.9638 4.7463 4.9109 2.2130 2.6938 2.5479 4.2500 1.4988 2.2110 2.6190 2.8124 1.4598 2.2996 1.4734 2.7599 1.4472 6.0099 1.4339 1.3165 1.7373 2.4537 2.1430 2.7710 2.2067 2.0674 1.2579 1.7241 1.3572 2.7070 1.0705 1.3601 1.2089 2.4687 1.3975 1.9587 1.7498 1.5920 1.2160 2.1055 1.2854 1.7394 6.1381 4.5190 1.6797 1.7157 1.5050 1.4408 1.3634 2.1459 1.5070 1.0545 1.1471 1.0686 1.7778 1.6448 6.4318 6.9125 6.3651 6.8058 1.0715 1.0696 1.0321 1.0596 1.0880 1.0995 1.0908 1.1026 1.0869 1.1018 1.0865 1.0891 1.0901 1.0987 1.0950 1.1002 1.0753
irintensity: 3.8977 3.5163 1.0060 1.1249 1.5005 0.8299 0.5625 5.7072 1.1686 4.8326 1.0978 9.0362 1.9476 0.3490 3.8926 5.8101 7.4442 15.4014 15.4550 0.8302 6.4810 7.8390 62.0210 3.4577 10.2177 4.3919 49.8438 2.9173 58.3668 2.1479 59.4842 9.5864 13.2620 13.4875 1.4019 1.9903 0.1516 5.2936 2.8509 49.6542 0.4076 0.2413 2.6813 2.1528 8.3815 14.4688 5.3606 16.0512 4.5889 5.1144 1.4632 13.8651 0.3764 2.6954 6.4816 71.3533 1.6284 6.4893 1.0871 8.5279 4.0808 2.8469 9.9566 4.9598 4.3724 6.7911 1.8247 21.4656 2.4485 12.9450 7.5842 34.8784 15.0496 6.5011 3.7539 13.1377 20.7335 9.5796 6.5810 11.2114 0.8812 5.6613 113.9482 26.9895 68.3064 32.9489 20.3667 31.4060 61.5086 31.0730 7.4320 21.1116 7.3791 14.4332 9.2695 25.5401 27.9165 22.2239 0.6270
temp: 298.150 k
press: 1.00000 atm
elementType: 8 7 6 6 6 6 6 6 6 6 6 6 6 6 6 6 6 6 1 1 1 1 1 1 1 1 1 1 1 1 1 1 1 1 1
symmnumber: 1
zpe: 757739.8 jmol-1
zpe.correction: 0.288608 hartree
zpe.thermalcorrener: 0.304444 hartree
zpe.thermalcorrenthalpy: 0.305389 hartree
zpe.thermalcorrgfe: 0.244865 hartree
zpe.sumelectzpe: -748.561973 hartree
zpe.sumelectthermal: -748.546136 hartree
zpe.sumelectthermalent: -748.545192 hartree
zpe.sumelectthermalfe: -748.605715 hartree
dipole: -0.0284 0.1423 1.2838
dipole: 1.2920
quadrupole: -95.1779 -100.0546 -104.5712
quadrupole: -1.6939 4.0947 0.5270
quadrupole: 4.7566 -0.1200 -4.6367 -1.6939 4.0947 0.5270
hfenergy: -748.8505805 hartree
pointgroup: C01 [X(C16H17N1O1)]
dipole: 0.0519374 0.3745247 -0.3397039 debye
polarizability: 227.8033493|-25.0828416|151.2502503|11.513083|16.5753237|155.1677189 unknown
InChI: InChI=1S/C16H17NO/c1-18-16-8-3-2-6-14(16)13-7-4-5-12-9-10-17-11-15(12)13/h2-8,17H,9-11H2,1H3
charge 0 multiplicity 1
35 atoms
O  1.45524 0.080034 -1.946697
N  -2.231789 -2.219104 -0.692936
C  -1.148437 -0.12866 0.106108
C  -2.451204 0.432174 0.232263
C  -3.679426 -0.295812 -0.306047
C  -0.955082 -1.479697 -0.576617
C  -3.301051 -1.404238 -1.305302
C  -0.024517 0.58108 0.632085
C  -2.61917 1.677328 0.889048
C  1.372176 0.03798 0.544649
C  -0.224283 1.812222 1.308041
C  -1.516891 2.364104 1.43582
C  2.054287 -0.187551 -0.687552
C  2.069033 -0.274502 1.743648
C  3.352222 -0.746171 -0.713528
C  3.370019 -0.822917 1.727167
C  4.01108 -1.071489 0.491582
C  1.203173 1.503241 -2.249306
H  -4.221669 -0.760713 0.540434
H  -4.369807 0.430446 -0.778629
H  -0.468194 -1.296176 -1.565223
H  -0.247255 -2.0901 0.014978
H  -4.174925 -2.048641 -1.509842
H  -2.986821 -0.939857 -2.274796
H  -2.103532 -3.12677 -1.156504
H  -3.627572 2.101775 0.975529
H  0.644643 2.341049 1.716341
H  -1.65911 3.321265 1.949599
H  1.557437 -0.107693 2.698608
H  3.824303 -0.910536 -1.687545
H  3.873259 -1.064179 2.669672
H  5.016561 -1.505954 0.465452
H  2.156607 2.066433 -2.262041
H  0.509794 1.957491 -1.518833
H  0.749998 1.512541 -3.252528
