program: Gaussian 09
title: 000052957
version: EM64L-G09RevD.01
frameworkgroup: C1[X(C7H11N5O4S2)]
method: RPBEPBE
basis: SDD
operation: Freq
keyword: #p
keyword: freq=noraman
keyword: PBEPBE/SDD
title: #p freq=noraman PBEPBE/SDD
converged: YES YES NO NO
title: Mulliken charges:
elementType: S S O O O O N N N N N C C C C C C C H H H H H H H H H H H
charge: 1.000085 0.367385 -0.486037 -0.529258 -0.278124 -0.166858 -0.328421 -0.340346 0.065719 -0.012856 -0.715283 -0.359218 -0.342575 -0.683549 -0.319621 0.116335 -0.085039 0.089542 0.223773 0.256796 0.222698 0.211832 0.354538 0.214295 0.233290 0.212319 0.380647 0.343170 0.354758
chargesum: 0.00000
title: Mulliken charges with hydrogens summed into heavy atoms:
elementType: S S O O O O N N N N N C C C C C C C
charge: 1.000085 0.367385 -0.486037 -0.529258 -0.278124 -0.166858 0.026117 0.040301 0.065719 -0.012856 -0.017354 0.121352 0.091955 -0.023644 -0.319621 0.116335 -0.085039 0.089542
polarizability: 2.93426369e+02 7.17389524e+00 1.56682657e+02 8.86653893e+00 7.37529359e+00 1.05772287e+02
1716.lowfreq: -5.2634 -1.9072 -0.0036 -0.0025 -0.0013 2.8759 11.7662 20.7847 24.7270
frequency: 11.3176 20.6521 24.7200 37.3943 46.0290 63.8397 76.8579 99.9896 110.8399 119.2347 146.2392 155.0967 197.8747 219.6113 230.9300 247.2643 258.1497 274.2541 287.1276 308.2660 337.6605 360.3245 371.4611 417.9332 436.7169 450.3449 505.4003 524.6521 549.5901 565.3236 588.0792 588.8894 706.7518 715.9503 749.9364 763.3779 768.2213 798.7182 813.6778 833.4535 855.7836 868.9954 905.8846 921.3343 929.7678 975.2196 1006.2184 1069.6506 1073.4857 1099.3633 1127.9849 1138.7553 1153.5439 1219.2196 1251.6952 1282.8316 1340.6896 1356.0732 1371.4036 1395.0721 1458.2140 1463.9622 1466.6120 1479.3433 1487.3984 1499.3777 1514.4180 1528.1933 1640.7527 1655.6023 2977.4951 2993.7690 2997.6517 3045.2405 3074.2593 3080.3121 3083.5780 3329.3075 3383.9637 3490.3410 3556.9070
redmass: 4.4092 6.9545 5.6552 7.6834 6.2115 6.3492 4.4011 2.8642 2.4256 8.0890 3.2987 4.9424 4.1478 4.3324 1.4467 2.6295 6.6745 7.0399 5.7860 6.1290 10.2660 2.5474 6.7177 11.6854 3.2596 3.4766 9.5380 5.0489 12.1291 13.7385 10.6657 10.6618 7.6729 1.1399 1.5796 1.8517 4.3463 2.7673 10.3716 1.2973 5.0443 1.9920 8.6246 2.2131 3.9098 2.2563 8.4861 2.4483 1.7416 2.2862 4.7485 1.9645 2.9676 2.0529 1.2308 1.2350 1.3965 1.2758 11.8137 1.2220 1.7257 1.0757 1.1847 1.0599 1.1415 3.0914 2.3615 1.0896 9.4770 6.4411 1.0364 1.0609 1.0647 1.0994 1.1003 1.1001 1.1001 1.0769 1.0410 1.0768 1.1020
irintensity: 0.5381 0.6649 1.6010 2.8073 0.6728 4.2096 0.9852 13.3670 5.0053 5.0190 11.9670 8.5406 3.7539 4.9694 4.4780 7.0711 1.3491 31.5045 8.4138 4.8159 8.9512 26.5111 9.7054 132.8952 126.5512 49.2292 7.9978 15.8337 1.9793 6.0057 27.1482 4.2610 18.3571 97.0929 23.6737 213.0917 27.9438 4.1487 61.6542 82.9846 7.9262 13.5942 38.5767 12.0702 61.3644 7.2404 16.6457 14.2961 20.1354 5.0761 21.5080 12.3981 15.6935 9.3480 21.7260 69.4494 0.9008 2.9716 21.4258 29.3442 236.9326 6.3016 22.2625 31.0603 106.8810 1312.4286 84.2672 40.5308 42.9219 260.8052 25.9195 27.9358 31.7339 5.8635 67.6714 27.2121 34.2772 269.5127 48.3873 47.0720 36.1603
temp: 298.150 k
press: 1.00000 atm
elementType: 16 16 8 8 8 8 7 7 7 7 7 6 6 6 6 6 6 6 1 1 1 1 1 1 1 1 1 1 1
symmnumber: 1
zpe: 522360.3 jmol-1
zpe.correction: 0.198957 hartree
zpe.thermalcorrener: 0.219445 hartree
zpe.thermalcorrenthalpy: 0.220389 hartree
zpe.thermalcorrgfe: 0.145163 hartree
zpe.sumelectzpe: -1642.533880 hartree
zpe.sumelectthermal: -1642.513392 hartree
zpe.sumelectthermalent: -1642.512448 hartree
zpe.sumelectthermalfe: -1642.587673 hartree
dipole: -5.9266 0.6476 3.1591
dipole: 6.7471
quadrupole: -94.7372 -134.9707 -118.6641
quadrupole: -2.4253 20.4684 -5.7420
quadrupole: 21.3868 -18.8467 -2.5401 -2.4253 20.4684 -5.7420
hfenergy: -1642.7328366 hartree
pointgroup: C01 [X(C7H11N5O4S2)]
dipole: 2.1120631 1.5361637 0.475271 debye
polarizability: 290.402264|23.9075586|107.7413992|-9.7319116|-4.990151|157.7376499 unknown
InChI: InChI=1S/C7H11N5O4S2/c1-2-3-9-4(13)5(14)10-6-11-12-7(17-6)18(8,15)16/h9-10H,2-3,8H2,1H3
charge 0 multiplicity 1
29 atoms
S  -5.358548 -0.570501 -0.033939
S  -2.403072 -0.330174 1.208047
O  -5.915897 -1.545611 -1.198049
O  -5.592634 -0.85415 1.547805
O  2.472083 0.215912 1.693546
O  1.430012 0.250845 -1.74894
N  3.769304 0.427402 -0.266221
N  0.2327 0.019956 0.3066
N  -2.922989 -0.228364 -1.424091
N  -1.528184 -0.074494 -1.352595
N  -5.877648 1.154159 -0.31454
C  5.088033 0.576578 0.374507
C  5.660979 2.008688 0.243403
C  5.910569 2.445184 -1.216431
C  -3.486004 -0.366043 -0.24517
C  2.609387 0.279471 0.426126
C  -1.084542 -0.101973 -0.086603
C  1.367467 0.183277 -0.498235
H  5.785036 -0.150406 -0.085502
H  4.959639 0.308513 1.437253
H  4.972408 2.717318 0.741238
H  6.612759 2.036647 0.808867
H  3.681769 0.463991 -1.2886
H  4.969948 2.491732 -1.796533
H  6.365175 3.450874 -1.25294
H  6.598244 1.747919 -1.731653
H  0.491169 0.001711 1.31086
H  -6.142206 1.294812 -1.301866
H  -6.609357 1.402525 0.369954
