program: Gaussian 09
title: 000052941
version: EM64L-G09RevD.01
frameworkgroup: C1[X(C13H9I2N3)]
method: RPBEPBE
basis: SDD
operation: Freq
keyword: #p
keyword: freq=noraman
keyword: PBEPBE/SDD
title: #p freq=noraman PBEPBE/SDD
converged: NO NO NO NO
title: Mulliken charges:
elementType: I I N N N C C C C C C C C C C C C C H H H H H H H H H
charge: 0.095470 0.095471 -0.063446 -0.684116 -0.684104 0.475332 0.475319 0.098073 0.098071 -0.474641 -0.424777 -0.424786 -0.743556 -0.743576 0.681625 0.681617 -0.437523 -0.437515 0.256202 0.234520 0.234518 0.223790 0.223794 0.312778 0.309345 0.312769 0.309344
chargesum: 0.00000
title: Mulliken charges with hydrogens summed into heavy atoms:
elementType: I I N N N C C C C C C C C C C C C C
charge: 0.095470 0.095471 -0.063446 -0.061992 -0.061991 0.475332 0.475319 0.098073 0.098071 -0.218439 -0.190257 -0.190268 -0.743556 -0.743576 0.681625 0.681617 -0.213732 -0.213721
polarizability: 4.05810403e+02 -1.47637204e-02 2.71568606e+02 9.31208703e-03 2.95594953e-02 7.22923039e+01
1716.lowfreq: -0.0004 0.0003 0.0006 2.2396 5.6188 7.1032 26.6575 55.7849 59.6590
frequency: 26.6553 55.7849 59.6560 105.1490 114.9524 124.3805 197.4404 210.6520 219.3953 234.9711 256.7058 318.4655 342.5846 352.7416 369.8513 393.6169 393.8955 432.6296 448.2885 460.2011 494.0100 498.0440 518.3238 519.3668 539.3656 587.0889 609.6143 633.5662 648.9532 664.8049 751.9375 766.9347 781.4373 795.0902 808.3436 816.2850 871.6338 877.3108 907.6253 947.2386 948.6263 957.8155 978.7402 1080.4253 1081.3792 1138.1492 1155.6909 1191.3682 1209.4600 1284.8190 1295.3551 1327.9313 1344.5136 1350.8063 1383.4659 1397.2666 1432.0804 1459.9936 1502.2235 1507.8608 1517.5884 1593.4392 1606.0714 1616.0922 1625.7367 1646.2281 3118.2780 3119.1589 3120.5625 3143.7296 3144.3432 3514.0814 3514.7522 3678.7281 3678.8022
redmass: 11.6313 58.6020 5.1392 4.4951 21.0815 6.5898 4.3282 7.3193 6.7398 5.2828 7.4844 4.4394 5.9295 5.8350 4.3388 1.1656 1.1624 3.2189 3.6855 5.4257 1.1356 1.2541 4.0759 3.1546 4.2232 5.8391 9.0866 3.6926 8.4508 3.2350 7.5551 7.1200 7.4083 1.6719 1.6244 4.3586 7.1834 5.8646 1.4669 1.3651 3.0219 1.4738 2.1190 1.8233 2.5989 1.4038 1.4584 1.3029 2.8412 2.8428 1.9407 2.6726 4.2986 4.1029 3.4136 7.0360 9.3148 3.7478 7.8298 4.0634 7.4321 4.4684 2.7761 1.3020 1.7858 4.9769 1.0885 1.0861 1.0895 1.0982 1.0981 1.0476 1.0477 1.1014 1.1014
irintensity: 0.0000 0.2134 5.7754 0.0000 0.1483 12.5213 4.5593 0.1184 4.4734 0.0001 2.1547 0.0001 0.8208 42.8058 2.0952 0.1740 258.9548 3.9568 1.2910 18.5554 0.0040 218.3014 0.1839 33.5745 0.0000 2.3318 15.6232 0.0001 12.4495 0.9763 12.7547 0.2991 0.0000 101.2488 0.0000 9.7096 61.3569 12.3913 33.1339 0.0000 4.4814 7.7681 1.2765 35.5993 0.9688 42.8435 2.4906 43.1451 31.4670 22.2814 7.8397 13.8655 151.9204 0.0356 4.1206 16.6705 0.0001 325.8911 0.0577 0.0337 16.3478 188.1068 255.0876 15.8004 1096.1465 11.1653 1.2919 3.4454 12.1825 36.7435 36.8241 163.6629 46.3113 68.6717 32.2187
temp: 298.150 k
press: 1.00000 atm
elementType: 53 53 7 7 7 6 6 6 6 6 6 6 6 6 6 6 6 6 1 1 1 1 1 1 1 1 1
symmnumber: 1
zpe: 501358.2 jmol-1
zpe.correction: 0.190957 hartree
zpe.thermalcorrener: 0.206830 hartree
zpe.thermalcorrenthalpy: 0.207774 hartree
zpe.thermalcorrgfe: 0.145467 hartree
zpe.sumelectzpe: -686.846752 hartree
zpe.sumelectthermal: -686.830880 hartree
zpe.sumelectthermalent: -686.829936 hartree
zpe.sumelectthermalfe: -686.892242 hartree
dipole: -0.0002 3.9628 -0.0054
dipole: 3.9628
quadrupole: -80.1550 -112.9353 -142.1803
quadrupole: -0.0001 -0.0214 -0.0008
quadrupole: 31.6018 -1.1784 -30.4234 -0.0001 -0.0214 -0.0008
hfenergy: -687.0377093 hartree
pointgroup: C01 [X(C13H9I2N3)]
dipole: -0.0000261 -1.5591022 0.0021171 debye
polarizability: 405.8104018|0.0185087|271.5686074|-0.0093129|0.0295592|72.2923039 unknown
InChI: InChI=1S/C13H9I2N3/c14-10-8(16)3-1-6-5-7-2-4-9(17)11(15)13(7)18-12(6)10/h1-5H,16-17H2
charge 0 multiplicity 1
27 atoms
I  -2.363181 3.020209 0.000111
I  2.362943 3.020314 0.000742
N  -0.000069 0.849263 0.000098
N  -4.883426 0.876791 0.00026
N  4.883278 0.877112 -0.000445
C  -1.230341 -1.303205 -0.000007
C  1.230344 -1.303129 -0.00005
C  -1.182486 0.16325 0.000038
C  1.182391 0.163346 0.000065
C  0.000021 -1.999404 -0.000074
C  -2.502633 -1.968505 0.000041
C  2.502666 -1.968348 -0.000039
C  -2.428329 0.876427 0.000073
C  2.428212 0.876547 0.000154
C  -3.671389 0.205519 0.000233
C  3.671311 0.205726 -0.000078
C  -3.68289 -1.243026 0.000208
C  3.682893 -1.242809 -0.000041
H  0.00005 -3.096665 -0.00011
H  -2.533904 -3.064463 -0.000031
H  2.534004 -3.064307 0.000001
H  -4.649777 -1.760378 0.000267
H  4.649803 -1.760116 -0.00005
H  -4.900107 1.896425 0.000291
H  -5.758678 0.361081 0.000656
H  4.899813 1.89675 0.000493
H  5.758581 0.361493 0.001393
