program: Gaussian 09
title: 000052965
version: EM64L-G09RevD.01
frameworkgroup: C1[X(C17H19NO)]
method: RPBEPBE
basis: SDD
operation: Freq
keyword: #p
keyword: freq=noraman
keyword: PBEPBE/SDD
title: #p freq=noraman PBEPBE/SDD
converged: YES YES NO NO
title: Mulliken charges:
elementType: O N C C C C C C C C C C C C C C C C C H H H H H H H H H H H H H H H H H H H
charge: -0.272527 -0.079111 0.057222 -0.475835 -0.524036 -0.400356 0.302628 0.226225 -0.404082 -0.626945 -0.408937 0.335599 -0.254542 -0.544216 -0.414649 0.339945 -0.227473 -0.383582 -0.537484 0.183658 0.252909 0.234700 0.208085 0.216569 0.186151 0.232520 0.229235 0.227132 0.183747 0.251115 0.225701 0.272956 0.238386 0.222192 0.242478 0.219929 0.244708 0.219985
chargesum: 0.00000
title: Mulliken charges with hydrogens summed into heavy atoms:
elementType: O N C C C C C C C C C C C C C C C C C
charge: -0.272527 -0.079111 0.057222 -0.039268 -0.081251 0.002365 0.302628 0.226225 -0.171562 0.013169 -0.157822 0.335599 -0.028841 -0.271261 -0.176263 0.339945 -0.005281 -0.141104 0.147137
polarizability: 2.66989682e+02 1.56682755e+01 1.93033178e+02 3.41470483e+00 -1.41789245e+01 1.28045306e+02
1716.lowfreq: -9.8869 -1.9754 -0.0006 -0.0004 -0.0002 8.3322 27.8492 50.2512 69.8707
frequency: 27.4543 49.8804 69.8657 84.3439 95.3616 123.3312 179.1053 202.6885 204.6783 224.5785 230.5011 248.4882 265.8365 272.4140 308.9065 329.0057 359.1155 386.8202 424.3994 437.4076 474.1349 480.9471 505.6591 532.6323 553.1730 603.9108 624.9334 628.1940 673.2804 703.6791 728.9370 755.8184 769.9092 784.3460 806.0992 830.5633 866.4702 877.7645 893.5982 912.4970 947.8775 964.0371 971.4738 979.5731 986.2152 992.0411 1015.4914 1042.6145 1061.6869 1076.0036 1086.3993 1099.3479 1112.1242 1114.1860 1142.5070 1155.3787 1171.7270 1180.7126 1189.0994 1198.5645 1202.0567 1213.0386 1239.7487 1263.3360 1284.7164 1291.6032 1306.2124 1336.0531 1344.6248 1362.9658 1381.3327 1382.8586 1418.5667 1429.1875 1434.7157 1440.8956 1450.3951 1452.6602 1463.0513 1464.9929 1466.4179 1474.7340 1476.2692 1480.1152 1484.4422 1578.6182 1595.4733 1599.8322 1616.5224 2795.7898 2829.1970 2850.5170 2957.3647 2977.3507 3018.6249 3019.3695 3029.3023 3035.8385 3044.2334 3078.5223 3113.5572 3123.5058 3128.8944 3132.0350 3152.0996 3155.1072 3158.6110 3167.6146
redmass: 4.5526 3.3101 3.6060 3.1918 3.5559 2.8906 2.9527 2.1535 1.9383 3.0910 1.4075 3.2406 1.8225 2.5440 3.3261 2.3426 2.8062 4.9374 3.5179 4.0857 3.3649 3.3246 3.7579 4.3052 3.8299 5.2527 4.6430 4.2431 5.3070 2.0592 2.5242 4.3970 1.8807 1.6268 1.9458 4.0336 2.7498 1.4732 1.5206 1.4420 2.8690 1.3437 1.4861 4.0021 1.8466 2.5475 3.6432 2.0702 2.2163 2.0092 2.0046 1.6862 1.2603 1.3547 2.0120 1.3615 1.2720 1.2504 1.5129 1.4645 2.0931 1.7843 2.0619 1.5249 1.5675 1.4970 2.0652 1.9906 1.8519 1.8832 3.8393 2.6576 2.5669 1.1853 1.3101 1.2486 1.2824 1.9818 1.2391 1.4108 1.0505 1.1086 1.1914 1.0658 2.6288 5.7326 6.8977 6.6312 6.7650 1.0707 1.0689 1.0592 1.0330 1.0600 1.0785 1.0781 1.0959 1.0931 1.1038 1.1010 1.0872 1.0990 1.0864 1.0901 1.0925 1.0987 1.0922 1.0972
irintensity: 0.1437 0.7112 3.7820 0.9468 3.3608 0.8152 1.3848 0.3794 1.2881 2.9830 0.1328 0.6535 1.3775 2.5419 3.8570 6.3210 1.7229 0.2106 0.4234 1.3705 3.6646 0.5025 1.1890 2.0055 6.9196 2.0015 0.5662 1.5821 2.5159 30.1337 7.6256 17.1572 55.3060 47.2982 7.1755 5.1279 13.4039 0.8138 14.1399 4.1423 11.7065 1.9211 0.5859 4.8419 2.8529 22.0828 44.3972 27.0744 1.3193 12.4316 12.9076 13.8632 0.1930 8.0208 20.1274 0.7207 32.9789 15.0199 9.2524 2.2039 58.3436 59.3430 0.6862 20.1178 34.4766 6.8046 10.1403 0.3618 11.8271 2.2520 15.6724 6.8117 30.9451 2.4844 4.7165 8.3411 15.1828 41.3797 14.6387 31.5310 13.2455 14.4492 17.3949 12.9145 14.9753 81.0462 8.8053 5.2715 90.0656 72.6690 63.3898 208.2716 76.2941 30.3796 21.9461 43.9614 34.1077 48.5245 49.8286 34.6094 8.4807 26.7617 6.3477 21.5369 17.6325 26.3163 6.2161 15.2598
temp: 298.150 k
press: 1.00000 atm
elementType: 8 7 6 6 6 6 6 6 6 6 6 6 6 6 6 6 6 6 6 1 1 1 1 1 1 1 1 1 1 1 1 1 1 1 1 1 1 1
symmnumber: 1
zpe: 829734.4 jmol-1
zpe.correction: 0.316029 hartree
zpe.thermalcorrener: 0.333073 hartree
zpe.thermalcorrenthalpy: 0.334017 hartree
zpe.thermalcorrgfe: 0.271047 hartree
zpe.sumelectzpe: -787.785250 hartree
zpe.sumelectthermal: -787.768206 hartree
zpe.sumelectthermalent: -787.767262 hartree
zpe.sumelectthermalfe: -787.830232 hartree
dipole: -0.9443 -1.7130 1.0588
dipole: 2.2242
quadrupole: -86.3720 -105.8422 -117.0934
quadrupole: 4.7185 1.0516 -2.3464
quadrupole: 16.7306 -2.7396 -13.9909 4.7185 1.0516 -2.3464
hfenergy: -788.1012792 hartree
pointgroup: C01 [X(C17H19N1O1)]
dipole: -0.4482386 0.4684735 -0.5876794 debye
polarizability: 269.0252425|-10.4413942|175.2765389|-3.4318488|-30.4176943|143.7663841 unknown
InChI: InChI=1S/C17H19NO/c1-18-10-9-13-5-4-8-16(17(13)12-18)14-6-3-7-15(11-14)19-2/h3-8,11H,9-10,12H2,1-2H3
charge 0 multiplicity 1
38 atoms
O  -4.318152 -0.230888 1.495428
N  2.601849 2.155268 -0.089639
C  1.49324 -0.093352 -0.044832
C  1.40731 1.370614 -0.470701
C  4.026687 0.177887 0.232011
C  3.839825 1.487734 -0.55035
C  2.756312 -0.662147 0.276025
C  0.312389 -0.89401 0.05984
C  2.837522 -2.015923 0.68609
C  2.495478 3.552642 -0.54681
C  0.421463 -2.24127 0.492166
C  -1.058267 -0.365549 -0.246235
C  1.676865 -2.80604 0.79918
C  -2.082892 -0.494906 0.720668
C  -1.37928 0.214099 -1.507179
C  -3.39923 -0.049811 0.447442
C  -2.691816 0.650608 -1.774187
C  -3.716121 0.52938 -0.805637
C  -5.696626 0.2068 1.268676
H  1.25148 1.417298 -1.583318
H  0.515191 1.839569 -0.015922
H  4.321476 0.431603 1.269154
H  4.855612 -0.411614 -0.206411
H  4.695749 2.163277 -0.368716
H  3.8062 1.278526 -1.652638
H  3.819589 -2.443766 0.924234
H  3.369469 4.127638 -0.192954
H  1.586348 4.014842 -0.121686
H  2.441526 3.65204 -1.661992
H  -0.487446 -2.8489 0.563871
H  1.746532 -3.851886 1.117908
H  -1.871297 -0.925152 1.704685
H  -0.611105 0.289845 -2.283272
H  -2.930068 1.084837 -2.751862
H  -4.727588 0.877389 -1.034788
H  -5.748139 1.296009 1.07361
H  -6.229338 -0.027646 2.202011
H  -6.161249 -0.342146 0.426132
