program: Gaussian 09
title: 000052947
version: EM64L-G09RevD.01
frameworkgroup: C1[X(C13H14N2O3)]
method: RPBEPBE
basis: SDD
operation: Freq
keyword: #p
keyword: freq=noraman
keyword: PBEPBE/SDD
title: #p freq=noraman PBEPBE/SDD
converged: YES YES NO NO
title: Mulliken charges:
elementType: O O O N N C C C C C C C C C C C C C H H H H H H H H H H H H H H
charge: -0.197373 -0.203773 -0.273005 -0.221907 -0.381038 -0.347786 -0.366617 0.178022 0.184258 0.086455 0.086024 -0.522149 -0.352955 -0.354342 0.259198 -0.211236 -0.211470 -0.606247 0.236127 0.230707 0.236262 0.261489 0.208605 0.234429 0.270045 0.269088 0.238706 0.238410 0.302463 0.225028 0.226559 0.278023
chargesum: 0.00000
title: Mulliken charges with hydrogens summed into heavy atoms:
elementType: O O O N N C C C C C C C C C C C C C
charge: -0.197373 -0.203773 -0.273005 -0.221907 -0.078575 0.119048 0.131135 0.178022 0.184258 0.086455 0.086024 -0.079115 -0.082910 -0.085254 0.259198 0.027470 0.026940 0.123362
polarizability: 2.21322760e+02 -6.72153540e+00 1.63342956e+02 -2.87878138e+01 3.79873791e+00 1.05435464e+02
1716.lowfreq: -0.0006 -0.0004 0.0005 2.1828 5.2838 6.3832 18.9188 22.2943 32.7983
frequency: 18.8789 22.2341 32.7796 60.6993 90.2020 108.5545 117.6203 137.9136 150.1518 180.1477 207.0196 229.7640 239.9947 262.9719 283.1409 332.0245 368.6242 411.7499 434.4644 456.1133 522.5615 524.4345 564.4210 589.5134 622.4903 659.0938 677.5445 691.0159 707.9735 717.6424 750.8413 785.1437 795.8380 819.2287 866.0499 879.7725 906.5273 956.1725 974.1968 1005.9480 1009.3474 1015.7313 1028.4879 1055.5602 1072.1974 1076.6657 1111.6367 1123.1868 1137.0532 1167.5896 1171.0374 1203.5032 1207.8740 1238.1697 1265.2509 1283.5975 1305.7680 1330.3813 1339.5424 1355.2219 1377.2026 1416.3493 1417.5785 1445.0975 1449.4414 1453.6480 1455.5041 1457.2426 1482.3872 1488.3372 1513.5023 1615.0022 1618.3090 1625.6387 1628.1384 1676.8273 2971.6776 2978.8059 3004.1894 3015.2134 3027.1989 3058.5254 3062.9394 3089.7893 3109.0115 3139.3181 3152.9551 3164.6266 3174.5260 3561.5531
redmass: 5.7669 4.7442 5.9715 3.3941 3.5895 2.1310 1.1757 5.0005 4.9403 5.6468 3.7427 4.3378 5.3460 3.2082 3.6203 10.1186 4.7607 3.1866 3.6849 4.8839 5.6379 5.6231 1.5813 3.0175 3.8893 4.8038 5.1334 4.7729 4.1303 3.1718 1.2533 5.2880 1.6868 2.2128 3.5008 2.6845 1.3910 6.5342 1.4135 1.3490 2.8423 2.0542 4.5209 3.4819 2.5913 2.4810 1.7152 1.3474 1.7621 1.2026 2.0200 2.9176 1.8718 1.5894 1.2969 1.4915 1.2132 1.3179 3.1405 1.7196 1.5299 5.9212 1.1795 1.1150 1.3788 2.4680 1.3416 1.7471 1.0885 1.0464 1.4448 7.7060 8.2701 6.4680 10.5798 11.7267 1.0584 1.0348 1.0596 1.0624 1.0976 1.1025 1.1031 1.1056 1.0982 1.0864 1.0906 1.0956 1.1004 1.0776
irintensity: 0.8933 8.9105 2.9434 2.4838 0.8469 1.8526 1.2272 0.0090 5.6864 0.2459 5.6323 0.8750 2.9903 2.5751 9.8693 20.8944 18.0503 0.8212 6.0687 0.0113 15.0734 1.6173 80.6933 37.8127 2.4987 0.0122 0.2782 3.5960 12.0588 70.8285 8.8805 0.0830 30.5681 3.2101 11.1832 7.5041 0.0017 15.8748 2.1964 0.2140 47.2138 2.2403 26.3922 1.2905 17.7598 17.5595 1.1869 0.9894 68.7846 8.7858 5.1762 15.7774 42.6486 28.0083 30.7556 0.4977 6.2364 46.6296 284.5883 25.6472 33.6665 10.2824 32.9153 5.6473 18.4717 11.4256 90.3814 10.1525 16.1604 16.1391 129.1999 2.0999 122.8453 93.5566 388.8120 44.7508 24.1245 74.6534 8.3457 34.3375 16.6177 37.7698 1.1869 15.2440 1.9203 1.7554 5.4808 6.1662 21.3460 17.0408
temp: 298.150 k
press: 1.00000 atm
elementType: 8 8 8 7 7 6 6 6 6 6 6 6 6 6 6 6 6 6 1 1 1 1 1 1 1 1 1 1 1 1 1 1
symmnumber: 1
zpe: 659679.5 jmol-1
zpe.correction: 0.251259 hartree
zpe.thermalcorrener: 0.268280 hartree
zpe.thermalcorrenthalpy: 0.269224 hartree
zpe.thermalcorrgfe: 0.203539 hartree
zpe.sumelectzpe: -837.698329 hartree
zpe.sumelectthermal: -837.681308 hartree
zpe.sumelectthermalent: -837.680364 hartree
zpe.sumelectthermalfe: -837.746048 hartree
dipole: -0.5993 -2.5673 -1.5563
dipole: 3.0614
quadrupole: -63.4948 -115.7334 -106.4727
quadrupole: -9.3264 -17.4937 -3.2389
quadrupole: 31.7389 -20.4998 -11.2391 -9.3264 -17.4937 -3.2389
hfenergy: -837.9495878 hartree
pointgroup: C01 [X(C13H14N2O3)]
dipole: 0.2249476 1.013545 -0.6106022 debye
polarizability: 220.9416066|-5.6972467|163.1304741|30.0084079|-3.4041529|106.0290992 unknown
InChI: InChI=1S/C13H14N2O3/c1-14-11(16)7-4-8-15-12(17)9-5-2-3-6-10(9)13(15)18/h2-3,5-6,14H,4,7-8H2,1H3
charge 0 multiplicity 1
32 atoms
O  1.070282 -2.501755 -0.60597
O  0.620014 2.181509 -0.812772
O  -4.269549 -1.062902 1.267166
N  0.52259 -0.195421 -0.829793
N  -5.556531 0.367602 -0.04535
C  -0.835996 -0.346083 -1.370744
C  -1.92054 -0.197491 -0.280559
C  2.623543 -0.668047 0.06047
C  2.489573 0.740686 -0.003955
C  1.366736 -1.289181 -0.471221
C  1.14154 1.062504 -0.576355
C  -3.337164 -0.319503 -0.883839
C  3.788444 -1.27081 0.556985
C  3.51672 1.593545 0.425855
C  -4.411763 -0.373463 0.211689
C  4.833725 -0.416415 0.996172
C  4.700003 0.99372 0.931353
C  -6.698627 0.394942 0.876345
H  -0.890907 -1.348639 -1.832997
H  -0.972506 0.419951 -2.156529
H  -1.808333 0.782611 0.218609
H  -1.798295 -0.979566 0.48925
H  -3.53205 0.50796 -1.594439
H  -3.406521 -1.266207 -1.457828
H  3.880014 -2.360503 0.601791
H  3.402358 2.680662 0.371306
H  5.758074 -0.850522 1.392048
H  5.523222 1.627581 1.277968
H  -5.601389 0.917245 -0.904238
H  -7.616645 0.014675 0.391279
H  -6.887811 1.417205 1.253099
H  -6.44601 -0.257787 1.727403
