program: Gaussian 09
title: 000052943
version: EM64L-G09RevD.01
frameworkgroup: C1[X(C12H12N2O3)]
method: RPBEPBE
basis: SDD
operation: Freq
keyword: #p
keyword: freq=noraman
keyword: PBEPBE/SDD
title: #p freq=noraman PBEPBE/SDD
converged: YES YES NO NO
title: Mulliken charges:
elementType: O O O N N C C C C C C C C C C C C H H H H H H H H H H H H
charge: -0.203370 -0.202878 -0.250952 -0.210042 -0.362113 0.186646 0.186987 -0.536103 0.114582 0.115026 -0.354545 -0.354493 0.281608 -0.211799 -0.211837 -0.336366 -0.639913 0.271774 0.270167 0.268285 0.268342 0.307605 0.237420 0.237441 0.217798 0.217831 0.245183 0.245399 0.202316
chargesum: 0.00000
title: Mulliken charges with hydrogens summed into heavy atoms:
elementType: O O O N N C C C C C C C C C C C C
charge: -0.203370 -0.202878 -0.250952 -0.210042 -0.054508 0.186646 0.186987 0.005838 0.114582 0.115026 -0.086260 -0.086151 0.281608 0.025621 0.025604 0.099264 0.052986
polarizability: 2.03579609e+02 4.20412639e-01 1.48775906e+02 -3.14274130e+01 1.43284061e-01 1.02793809e+02
1716.lowfreq: -85.6913 -12.2936 -9.4302 -0.0007 -0.0007 -0.0006 7.1003 9.4295 38.7716
frequency: -85.6910 -8.2067 38.5693 38.9449 112.4567 120.9670 139.2313 176.8038 207.3612 221.4907 248.1357 267.8024 291.2207 330.3537 353.6757 406.3875 417.7746 455.4895 521.7867 530.8294 539.8084 595.5780 605.6596 657.7531 682.7572 685.5444 703.5323 735.1478 787.8696 797.2144 799.3104 832.0876 855.7498 897.6472 906.8098 942.2827 973.9522 981.0145 1005.6380 1019.8033 1068.7188 1072.4197 1087.1574 1111.2662 1141.4019 1169.0391 1172.8614 1211.5787 1245.1565 1283.4648 1288.2309 1311.3762 1318.1742 1345.1659 1371.3511 1409.1642 1415.1312 1425.8700 1454.3149 1454.7743 1468.9123 1473.9623 1485.0407 1531.0511 1614.8726 1620.4402 1634.6755 1658.7390 1685.0155 2961.7501 3003.0980 3003.1291 3007.7308 3075.1646 3101.0705 3132.4549 3138.2428 3152.1873 3164.1995 3173.8726 3511.8022
redmass: 2.2412 4.9203 5.4596 5.1207 7.5753 3.0459 5.0505 7.1423 5.7347 2.7704 4.2955 4.7967 1.0932 8.9390 8.3068 3.9631 3.4204 4.8994 5.3996 3.4310 6.4466 1.1768 8.3751 4.8204 6.9417 4.3940 5.0883 3.2086 5.1513 1.7645 1.1250 4.8492 5.0217 2.9610 1.4068 3.5318 1.4154 4.9815 1.3467 2.0168 3.2854 2.5315 2.7816 1.9588 1.5137 1.1499 2.0321 3.2747 2.4188 1.4813 1.1018 1.3981 1.4335 1.3795 7.3745 1.2077 4.3376 1.2159 2.4799 2.7938 1.0396 1.0637 1.1365 1.5341 7.6909 7.7771 12.1465 7.3638 11.2469 1.0579 1.0567 1.0870 1.0575 1.1038 1.0954 1.1013 1.0863 1.0906 1.0956 1.1003 1.0759
irintensity: 0.3617 2.7895 4.4146 4.0693 3.4082 1.4303 0.1052 1.2848 1.2892 3.4658 4.1153 9.7907 0.0197 6.8776 12.4800 8.5046 1.0227 0.0192 0.2695 24.9969 8.6816 78.4996 19.0976 0.0254 0.2675 10.7546 16.0224 75.2675 0.0878 21.7222 1.4566 0.8366 5.4102 9.4116 0.0474 68.3605 2.0049 15.9294 0.0030 0.0005 13.2099 22.7162 22.9576 4.4449 8.1207 11.7165 5.9369 51.5157 105.6262 0.0010 0.9097 13.4469 33.3873 169.4234 252.1159 24.1621 0.7341 56.9151 11.8131 2.2161 11.8806 25.7219 5.0035 125.9420 0.6660 50.2388 413.5307 215.7248 14.3393 73.3135 35.9836 34.1074 21.6932 0.1033 35.3033 22.5536 1.8490 6.0361 6.5293 21.5525 13.9858
temp: 298.150 k
press: 1.00000 atm
elementType: 8 8 8 7 7 6 6 6 6 6 6 6 6 6 6 6 6 1 1 1 1 1 1 1 1 1 1 1 1
symmnumber: 1
zpe: 585204.0 jmol-1
zpe.correction: 0.222892 hartree
zpe.thermalcorrener: 0.236671 hartree
zpe.thermalcorrenthalpy: 0.237615 hartree
zpe.thermalcorrgfe: 0.181555 hartree
zpe.sumelectzpe: -798.465649 hartree
zpe.sumelectthermal: -798.451871 hartree
zpe.sumelectthermalent: -798.450926 hartree
zpe.sumelectthermalfe: -798.506986 hartree
dipole: 0.5298 0.0609 -1.5159
dipole: 1.6069
quadrupole: -59.4921 -108.7848 -97.2100
quadrupole: 0.2146 -12.5859 -0.0833
quadrupole: 29.0036 -20.2892 -8.7144 0.2146 -12.5859 -0.0833
hfenergy: -798.6885417 hartree
pointgroup: C01 [X(C12H12N2O3)]
dipole: -0.2202648 -0.0137948 0.5924406 debye
polarizability: 204.7888549|1.5126397|148.6103451|-29.364343|2.7884415|101.750124 unknown
InChI: InChI=1S/C12H12N2O3/c1-2-13-10(15)7-14-11(16)8-5-3-4-6-9(8)12(14)17/h3-6,13H,2,7H2,1H3
charge 0 multiplicity 1
29 atoms
O  0.205397 2.310783 0.955581
O  0.216355 -2.387676 0.690858
O  -1.973438 0.045221 -1.054546
N  -0.097536 -0.046811 0.960424
N  -3.76532 -0.004793 0.48351
C  1.944848 0.71297 0.149569
C  1.947616 -0.701463 0.068851
C  -1.488516 -0.072848 1.365826
C  0.628282 1.154946 0.710078
C  0.633391 -1.20964 0.576039
C  3.052244 1.471057 -0.257703
C  3.057773 -1.403991 -0.422017
C  -2.432857 -0.002664 0.119145
C  4.18003 0.769823 -0.758792
C  4.182689 -0.64594 -0.839837
C  -4.980528 0.036142 -0.371036
C  -4.739117 0.097098 -1.889618
H  -1.672735 -1.011758 1.919063
H  -1.676642 0.792273 2.027324
H  3.037917 2.56342 -0.191587
H  3.047542 -2.496827 -0.480717
H  -3.954616 -0.042792 1.488989
H  5.062021 1.328282 -1.090343
H  5.066639 -1.159645 -1.232802
H  -5.586817 -0.863002 -0.137589
H  -5.578739 0.918546 -0.064453
H  -4.172397 0.99501 -2.179156
H  -4.178048 -0.778139 -2.250674
H  -5.725536 0.120421 -2.389588
