program: Gaussian 09
title: 000006781
version: EM64L-G09RevD.01
frameworkgroup: C1[X(C12H14O4)]
method: RPBEPBE
basis: SDD
operation: Freq
keyword: #pfreq=noraman
keyword: PBEPBE/SDD
title: #p freq=noraman PBEPBE/SDD
converged: YES YES NO NO
title: Mulliken charges:
elementType: O O O O C C C C C C C C C C C C H H H H H H H H H H H H H H
charge: -0.263367 -0.281536 -0.239780 -0.244140 0.211223 0.137384 -0.372465 -0.333554 0.152974 0.180843 -0.219363 -0.221641 -0.215315 -0.218162 -0.677037 -0.673144 0.266342 0.268835 0.238293 0.236690 0.238778 0.227902 0.230892 0.227444 0.231323 0.209807 0.227744 0.212920 0.232766 0.227342
chargesum: 0.00000
title: Mulliken charges with hydrogens summed into heavy atoms:
elementType: O O O O C C C C C C C C C C C C
charge: -0.263367 -0.281536 -0.239780 -0.244140 0.211223 0.137384 -0.106123 -0.064720 0.152974 0.180843 0.018931 0.015049 0.251365 0.240175 -0.008163 -0.000116
polarizability: 1.67334031e+02 -7.70988582e+00 1.76311578e+02 -6.53932772e+00 -1.28989546e+01 8.94198609e+01
1716.lowfreq: -10.1462 0.0003 0.0007 0.0008 3.4093 5.6100 10.3756 36.7262 53.4407
frequency: -1.5470 36.6205 53.4200 60.4415 71.6303 88.1357 101.6350 124.8748 164.1490 195.4161 213.8493 246.0747 254.7574 262.2248 295.2115 327.4565 351.4156 379.8766 390.7938 418.3571 522.8575 542.0818 641.9657 668.7671 680.8142 703.0150 772.0114 784.4967 793.4175 798.0997 799.3564 806.9031 837.2614 859.2958 903.9360 976.3104 1003.8054 1017.4046 1018.7764 1035.7452 1041.6168 1083.8213 1112.4865 1112.8464 1121.1617 1133.8153 1135.5226 1177.0885 1229.2706 1245.6154 1248.2196 1248.7760 1279.2047 1357.1756 1357.8025 1381.1744 1398.0467 1401.4626 1429.8572 1461.9212 1463.4492 1471.1869 1473.7982 1476.3983 1484.4314 1486.4769 1578.8632 1602.5288 1618.6125 1620.8823 2994.9050 2995.7732 3008.6673 3010.8764 3066.8583 3070.6028 3091.2792 3092.0851 3107.1860 3107.3069 3137.3554 3152.3098 3166.9628 3179.4558
redmass: 2.9643 3.2463 5.5171 2.3698 3.3945 2.6823 4.2290 4.1177 3.5388 2.1790 2.6747 2.0289 1.6835 3.2862 4.7405 6.5055 4.1819 4.3025 4.6342 3.6522 4.7633 4.6765 6.5400 6.0727 7.2631 4.0980 3.2670 2.0508 3.4216 1.1172 1.1302 4.4104 3.7438 4.8487 1.4557 1.3975 1.3524 2.5899 2.4312 3.2404 4.8017 3.7973 2.2272 2.2282 1.8476 1.4691 1.4710 1.0609 3.6547 2.5536 1.1372 1.1677 1.5563 1.4045 1.4000 10.2027 1.2750 1.2670 2.2240 1.0404 1.0406 1.1158 1.0629 2.2561 1.0776 1.0843 7.2926 6.6404 11.1879 11.0528 1.0357 1.0359 1.0582 1.0579 1.1066 1.1064 1.0984 1.0985 1.1025 1.1028 1.0862 1.0911 1.0964 1.0979
irintensity: 0.1438 0.3815 0.3387 0.7058 3.6680 4.5990 2.6570 0.2564 0.6802 0.8131 3.4498 3.5644 0.3058 5.4072 3.3941 9.3692 9.1418 4.6499 2.7357 1.7590 2.3315 3.1050 3.9771 5.7851 3.1319 64.6683 20.5212 35.9534 4.3216 2.0112 8.6044 0.1306 7.7270 2.7026 0.8319 3.4924 1.7916 5.1877 9.8897 118.9693 197.1724 275.3143 2.9313 3.9031 44.9867 3.7078 5.3827 0.5788 178.4807 319.2133 2.9066 13.0355 41.2360 2.4688 1.1192 10.0172 21.8448 21.8572 7.0307 12.5180 11.7937 9.6551 2.7817 16.5983 7.2825 13.7093 24.4594 47.5487 253.1273 68.2300 20.5116 22.9362 18.3569 18.8174 8.4939 4.3423 30.1560 31.3682 32.7335 52.0472 1.9437 9.1551 12.8704 12.0613
temp: 298.150 k
press: 1.00000 atm
elementType: 8 8 8 8 6 6 6 6 6 6 6 6 6 6 6 6 1 1 1 1 1 1 1 1 1 1 1 1 1 1
symmnumber: 1
zpe: 619772.1 jmol-1
zpe.correction: 0.236059 hartree
zpe.thermalcorrener: 0.251745 hartree
zpe.thermalcorrenthalpy: 0.252689 hartree
zpe.thermalcorrgfe: 0.191873 hartree
zpe.sumelectzpe: -765.389640 hartree
zpe.sumelectthermal: -765.373954 hartree
zpe.sumelectthermalent: -765.373010 hartree
zpe.sumelectthermalfe: -765.433826 hartree
dipole: 2.7846 0.6395 -2.3093
dipole: 3.6736
quadrupole: -85.0280 -75.0223 -100.7675
quadrupole: -2.5413 6.6973 1.0163
quadrupole: 1.9113 11.9169 -13.8282 -2.5413 6.6973 1.0163
hfenergy: -765.6256989 hartree
pointgroup: C01 [X(C12H14O4)]
dipole: 1.0442431 -0.0727951 -0.9965927 debye
polarizability: 161.3987832|-2.1877129|181.2492535|-16.1895456|-2.1899987|90.417434 unknown
InChI: InChI=1S/C12H14O4/c1-3-15-11(13)9-7-5-6-8-10(9)12(14)16-4-2/h5-8H,3-4H2,1-2H3
charge 0 multiplicity 1
30 atoms
O  -1.877088 -0.871959 -0.458674
O  2.168674 -0.740892 -0.369432
O  -2.916496 0.320472 1.256495
O  0.455213 -1.308621 1.103209
C  -0.912584 1.218126 0.185538
C  0.466002 0.894012 0.023575
C  -1.328312 2.567411 0.090094
C  1.389365 1.924394 -0.287562
C  -1.985347 0.194364 0.425522
C  0.975967 -0.484109 0.31407
C  -0.399604 3.587726 -0.20716
C  0.960834 3.262502 -0.411015
C  -2.809047 -2.015602 -0.219297
C  2.798121 -2.068752 -0.096433
C  -2.517309 -3.051361 -1.29942
C  4.080925 -2.125193 -0.919182
H  -2.386445 2.801972 0.243543
H  2.443386 1.662335 -0.412561
H  -0.736636 4.626937 -0.282958
H  1.685982 4.047943 -0.648654
H  -2.613459 -2.397768 0.798735
H  -3.846395 -1.636775 -0.258736
H  2.983375 -2.149884 0.990168
H  2.07677 -2.8563 -0.38053
H  -1.469912 -3.392919 -1.238892
H  -3.178109 -3.927346 -1.165851
H  -2.692282 -2.633585 -2.305709
H  4.58415 -3.096372 -0.760209
H  3.863435 -2.01856 -1.995559
H  4.777227 -1.322095 -0.622612
