program: Gaussian 09
title: 000052939
version: EM64L-G09RevD.01
frameworkgroup: C1[X(C14H21NO5S)]
method: RPBEPBE
basis: SDD
operation: Freq
keyword: #p
keyword: freq=noraman
keyword: PBEPBE/SDD
title: #p freq=noraman PBEPBE/SDD
converged: YES YES NO NO
title: Mulliken charges:
elementType: S O O O O O N C C C C C C C C C C C C C C H H H H H H H H H H H H H H H H H H H H H
charge: 0.944461 -0.253522 -0.328995 -0.546808 -0.525862 -0.240372 -0.736730 -0.382013 -0.217175 0.346286 -0.296871 -0.342348 0.386039 -0.504326 -0.227371 -0.349257 0.044518 0.213324 -0.684931 -0.686367 -0.720877 0.215146 0.214273 0.209885 0.211220 0.195077 0.195088 0.299957 0.303556 0.266068 0.239366 0.213378 0.213972 0.220264 0.268555 0.250568 0.207021 0.223015 0.229220 0.229044 0.333657 0.370867
chargesum: 0.00000
title: Mulliken charges with hydrogens summed into heavy atoms:
elementType: S O O O O O N C C C C C C C C C C C C C C
charge: 0.944461 -0.253522 -0.328995 -0.546808 -0.525862 -0.240372 -0.032206 0.047406 -0.217175 0.346286 0.124234 0.047817 0.386039 -0.204369 0.076186 -0.083189 0.283884 0.213324 -0.037317 0.039777 -0.039598
polarizability: 3.00503212e+02 1.79821634e+00 2.01073554e+02 -2.11714654e+00 5.67931106e+00 1.36431716e+02
1716.lowfreq: -4.7979 -1.7944 -0.0015 -0.0009 0.0007 4.3879 15.0945 29.8597 49.2097
frequency: 14.5034 29.7846 49.2079 62.3147 67.2749 75.3475 85.0373 100.5183 113.2653 119.5714 145.8626 153.0719 164.8613 167.5315 185.5565 194.4591 209.1325 225.3982 230.8724 238.4189 247.5992 260.6470 270.8562 315.3923 330.5707 357.3700 378.0687 380.6284 392.6930 397.2765 423.4028 435.4248 463.5685 475.4050 483.8174 544.7274 585.3847 613.5362 658.1353 699.2293 745.1761 746.5920 759.5857 776.9810 789.5057 814.0390 815.2615 842.8490 865.9734 896.3262 908.4122 921.2390 930.6784 933.8557 941.9200 946.0528 974.2383 982.4184 991.1372 1041.4884 1071.1505 1083.5996 1088.8448 1104.5228 1125.0661 1145.5986 1149.0136 1159.1617 1184.7932 1198.3135 1215.1620 1239.4135 1266.9694 1276.8572 1284.9093 1288.2641 1324.7178 1331.2970 1348.3135 1375.1493 1384.3034 1393.6421 1397.2212 1399.5594 1407.6194 1455.3059 1455.8071 1469.0096 1470.7350 1474.0524 1476.4479 1478.4728 1482.5126 1491.8193 1492.2194 1504.9074 1566.0287 1606.9546 1615.2603 2953.6988 2968.7086 2978.8065 2986.5131 2995.7433 2998.4943 3011.5352 3014.9468 3032.2669 3063.5067 3077.5611 3079.5044 3087.1547 3089.8891 3094.9112 3114.0763 3143.5078 3173.2466 3176.6748 3380.4969 3557.8750
redmass: 3.9091 4.8566 4.2426 1.8224 4.1411 3.2530 4.9912 4.5734 4.8536 3.8693 2.2446 5.4085 4.9879 3.1166 3.8208 1.2626 3.1396 2.8486 1.1608 5.3525 2.3006 1.3109 4.0090 5.0324 5.1859 3.5703 3.6725 3.5809 3.4997 2.9689 5.0797 4.1882 2.9194 4.9166 3.5584 4.0543 4.5682 6.9126 7.5713 4.5246 1.1060 4.0741 5.6785 2.4034 3.5503 1.5318 2.5903 1.3957 4.6041 2.5749 1.9276 7.2067 1.5930 1.2883 1.1541 1.3361 5.6508 1.3452 6.6903 3.3823 1.5431 2.1873 1.9294 1.7684 2.6204 1.4546 1.6650 2.0291 1.9385 2.4752 1.3634 1.9815 1.8461 1.3669 1.1769 1.0608 1.3124 1.5356 1.4676 1.8507 1.2574 1.6792 1.9006 1.2422 4.0205 2.5974 1.0851 1.0457 1.0825 1.0715 1.0511 1.0416 1.0775 1.0950 1.0513 1.0924 6.4465 7.2349 10.8002 1.0552 1.0592 1.0362 1.0358 1.0366 1.0594 1.1013 1.1060 1.0869 1.1044 1.1016 1.0995 1.0988 1.1009 1.0979 1.1013 1.0901 1.0919 1.0939 1.0402 1.1019
irintensity: 2.1172 0.3316 0.3817 1.4645 1.6221 0.5747 3.4083 0.3836 0.8878 1.9817 1.7119 0.6825 1.5282 2.5760 6.3265 0.2678 4.9373 2.0239 0.3432 4.8075 18.0310 1.1316 6.2100 8.4547 15.6857 7.1504 21.0925 7.7550 2.9110 15.6924 66.6865 14.1990 1.0537 22.8888 108.1591 28.1455 22.2240 1.9765 4.1150 2.9634 12.0983 2.4032 12.5626 46.6962 81.9345 25.0548 29.4133 33.9541 17.6615 5.6801 49.1798 93.1234 26.5549 1.1073 0.7674 3.1719 259.8106 8.4172 32.9176 42.5432 77.0606 2.7559 162.2872 14.9666 3.4814 2.6545 16.4283 10.8351 27.0342 38.4724 0.0587 315.0870 317.2776 61.8026 0.3294 0.1488 7.9869 1.6706 0.1719 50.4238 36.2422 2.1458 3.9899 30.7083 67.1443 43.4314 5.2949 7.2953 1.0797 0.0929 17.2814 13.4441 10.2941 14.7741 34.8346 17.4208 152.3361 53.5599 137.7543 21.8869 36.2211 35.7526 14.9357 21.4228 32.9246 24.3166 2.3700 7.6931 13.3919 98.9389 48.2106 12.1021 23.5230 43.0809 9.2590 7.1083 2.6000 14.4479 31.7922 63.1040
temp: 298.150 k
press: 1.00000 atm
elementType: 16 8 8 8 8 8 7 6 6 6 6 6 6 6 6 6 6 6 6 6 6 1 1 1 1 1 1 1 1 1 1 1 1 1 1 1 1 1 1 1 1 1
symmnumber: 1
zpe: 874659.0 jmol-1
zpe.correction: 0.333140 hartree
zpe.thermalcorrener: 0.357218 hartree
zpe.thermalcorrenthalpy: 0.358162 hartree
zpe.thermalcorrgfe: 0.278335 hartree
zpe.sumelectzpe: -1373.222562 hartree
zpe.sumelectthermal: -1373.198484 hartree
zpe.sumelectthermalent: -1373.197540 hartree
zpe.sumelectthermalfe: -1373.277367 hartree
dipole: 2.9560 -1.4897 3.2553
dipole: 4.6427
quadrupole: -95.7187 -147.0684 -138.1532
quadrupole: 17.2026 -12.6531 1.7877
quadrupole: 31.2614 -20.0883 -11.1731 17.2026 -12.6531 1.7877
hfenergy: -1373.5557021 hartree
pointgroup: C01 [X(C14H21N1O5S1)]
dipole: 1.222751 0.8813515 -1.0317258 debye
polarizability: 299.9252356|-4.5030963|194.0687463|9.1140531|20.7559578|144.0145004 unknown
InChI: InChI=1S/C14H21NO5S/c1-4-5-8-19-11-6-7-13(21(15,17)18)12(9-11)14(16)20-10(2)3/h6-7,9-10H,4-5,8,15H2,1-3H3
charge 0 multiplicity 1
42 atoms
S  -2.4160 -1.695109 -0.674122
O  3.143831 0.699777 -0.02339
O  -2.786573 1.307949 -0.573821
O  -2.101273 -3.262664 -0.985144
O  -3.377376 -1.344828 0.591323
O  -1.423497 2.583042 0.818377
N  -3.004251 -1.048167 -2.266898
C  5.56314 0.714379 0.089351
C  -0.731696 -0.818395 -0.528436
C  -0.539775 0.537596 -0.154245
C  4.341119 -0.150813 -0.218765
C  6.884746 -0.06784 -0.096703
C  1.890973 0.12549 -0.215789
C  0.789677 0.987014 0.007149
C  0.347064 -1.686259 -0.749276
C  1.6696 -1.220502 -0.603744
C  -3.97467 2.195546 -0.230738
C  -1.60175 1.56826 0.103749
C  8.124761 0.793195 0.225014
C  -4.531471 1.768619 1.133625
C  -4.960454 2.019588 -1.387585
H  5.488227 1.086851 1.128646
H  5.553187 1.601384 -0.572447
H  4.362585 -0.51651 -1.266427
H  4.285448 -1.02282 0.465442
H  6.880383 -0.965213 0.555305
H  6.953021 -0.438262 -1.139893
H  0.966286 2.021422 0.315407
H  0.139156 -2.727229 -1.020427
H  2.500326 -1.907308 -0.784033
H  -3.581856 3.228179 -0.191023
H  8.173799 1.680396 -0.433474
H  8.09779 1.152004 1.270754
H  9.058506 0.218454 0.088446
H  -4.748265 0.687091 1.13453
H  -3.811768 1.984887 1.93984
H  -5.462145 2.327403 1.342944
H  -5.366086 0.99197 -1.409056
H  -4.486304 2.249047 -2.358466
H  -5.809687 2.712621 -1.252279
H  -3.694441 -1.702488 -2.665865
H  -3.317986 -0.073256 -2.144655
