program: Gaussian 09
title: 000052928
version: EM64L-G09RevD.01
frameworkgroup: C1[X(C11H14BrN3O4)]
method: RPBEPBE
basis: SDD
operation: Freq
keyword: #p
keyword: freq=noraman
keyword: PBEPBE/SDD
title: #p freq=noraman PBEPBE/SDD
converged: YES YES NO NO
title: Mulliken charges:
elementType: Br O O O O N N N C C C C C C C C C C C H H H H H H H H H H H H H H
charge: 0.008932 -0.259647 -0.430813 -0.449337 -0.265545 -0.208345 -0.046017 -0.631030 -0.126837 -0.556197 -0.012380 -0.042254 -0.383150 -0.217774 0.035031 0.201092 0.085880 -0.078766 -0.589014 0.213521 0.240044 0.291420 0.287984 0.284733 0.212217 0.219673 0.341773 0.339359 0.360432 0.221263 0.342930 0.327570 0.283252
chargesum: 0.00000
title: Mulliken charges with hydrogens summed into heavy atoms:
elementType: Br O O O O N N N C C C C C C C C C C C
charge: 0.008932 -0.259647 -0.089040 -0.088905 -0.265545 -0.208345 -0.046017 0.039470 0.086684 -0.024733 0.275604 0.242479 0.048741 0.121584 0.035031 0.201092 0.085880 0.142497 -0.305762
polarizability: 2.65462597e+02 2.46022010e+01 1.84943781e+02 -8.70587441e+00 7.69318124e+00 9.50169792e+01
1716.lowfreq: -2.1289 -0.0003 0.0002 0.0005 2.6922 4.3036 24.9675 36.6425 52.1066
frequency: 24.9129 36.6201 52.1014 59.6665 89.5130 103.1409 108.8807 133.1031 144.0744 164.6809 187.4366 205.1374 210.3597 260.6358 275.3223 290.8915 308.0766 324.8389 330.7862 354.2878 391.3099 400.9712 434.8786 448.3864 462.1861 504.2596 522.2280 554.4204 593.5453 602.3227 658.3363 692.4553 711.1315 727.7273 742.5854 746.5383 761.7626 783.4713 805.4357 857.4632 868.8011 915.6961 934.3963 944.3740 963.2941 981.8415 985.6319 1011.3252 1034.7430 1037.5873 1045.5159 1068.1386 1086.1030 1155.8353 1163.5361 1175.5278 1198.1956 1203.4993 1226.7456 1235.5654 1249.6647 1259.0814 1280.0877 1286.5522 1293.7349 1318.3397 1333.5853 1342.3752 1380.4707 1391.8985 1411.6240 1458.9975 1470.3144 1471.4062 1474.8273 1581.9733 1602.1685 1626.3454 1637.0184 2937.7430 2970.4666 2996.8402 3036.9408 3072.5966 3094.1787 3094.9702 3109.1420 3121.7764 3189.0406 3540.5055 3569.8815 3574.8304 3696.1624
redmass: 6.1226 6.1210 6.2104 6.6216 6.7073 2.5293 3.9378 4.2205 5.9602 5.2989 6.3317 4.3191 6.6654 5.0553 1.1991 1.1787 3.8974 5.9871 4.0739 4.0216 4.9674 5.0988 2.5949 1.3873 2.8583 3.0842 5.7148 6.0632 1.2923 4.3398 4.2495 5.7192 5.6348 5.2943 6.9860 4.8997 3.8950 2.5964 3.6156 2.9850 3.4392 2.9324 1.1717 2.5482 4.7432 1.5927 1.7427 2.6328 4.2590 3.2736 2.9667 2.3234 2.5469 1.3036 2.1143 1.3200 1.2523 1.5616 1.2647 2.0001 1.3085 1.3373 1.4855 1.4252 1.5220 1.5654 1.2468 1.4275 1.5312 2.1042 1.4572 1.1294 1.0880 3.6532 6.1915 3.0256 6.5811 1.8597 5.8075 1.0571 1.0854 1.1037 1.0647 1.0881 1.0885 1.0893 1.1012 1.0965 1.0951 1.0454 1.0663 1.0667 1.1039
irintensity: 1.3082 1.4190 2.1322 6.1071 6.2614 4.9047 2.9276 1.4661 9.4435 5.1803 3.0567 10.7712 4.6495 0.3785 131.9549 190.0271 16.3498 14.2875 8.1874 1.0196 4.6896 1.2002 8.4261 152.4252 4.9696 17.4607 62.4349 4.3514 118.3015 6.5406 21.5821 12.4316 12.2650 23.3968 18.2164 12.6110 8.4645 40.3087 17.3800 9.9187 11.0826 30.9035 52.9750 46.4329 51.9597 27.7942 24.4286 98.6164 78.4157 70.9606 45.0808 3.0825 7.6533 39.0773 12.6616 1.2763 5.1668 43.1216 4.3786 63.0333 26.2413 7.1622 146.9210 1.6555 41.6429 44.6651 3.9514 24.3293 2.6508 17.1303 0.9756 15.7386 7.1518 147.2229 202.0282 138.0785 22.3277 193.2770 852.4543 34.8615 55.3273 62.2161 12.8278 6.6474 16.0989 13.3830 12.7857 47.3767 20.6707 96.4001 9.3753 7.8497 37.2764
temp: 298.150 k
press: 1.00000 atm
elementType: 35 8 8 8 8 7 7 7 6 6 6 6 6 6 6 6 6 6 6 1 1 1 1 1 1 1 1 1 1 1 1 1 1
symmnumber: 1
zpe: 653028.1 jmol-1
zpe.correction: 0.248725 hartree
zpe.thermalcorrener: 0.267778 hartree
zpe.thermalcorrenthalpy: 0.268722 hartree
zpe.thermalcorrgfe: 0.199642 hartree
zpe.sumelectzpe: -904.716079 hartree
zpe.sumelectthermal: -904.697027 hartree
zpe.sumelectthermalent: -904.696082 hartree
zpe.sumelectthermalfe: -904.765163 hartree
dipole: -1.3589 -2.5002 4.3253
dipole: 5.1774
quadrupole: -116.1670 -127.3345 -120.4697
quadrupole: -20.8883 6.9157 -8.1599
quadrupole: 5.1567 -6.0107 0.8540 -20.8883 6.9157 -8.1599
hfenergy: -904.9648043 hartree
pointgroup: C01 [X(C11H14Br1N3O4)]
dipole: 0.0319534 1.3049662 -1.5637071 debye
polarizability: 221.7684527|-47.7552494|226.6012775|3.9562148|17.9176884|97.0536275 unknown
InChI: InChI=1S/C11H14BrN3O4/c12-2-1-6-4-15(11(18)14-10(6)13)9-3-7(17)8(5-16)19-9/h1-2,4,7-9,16-17H,3,5,13H2
charge 0 multiplicity 1
33 atoms
Br -3.782652 4.015717 0.535562
O  1.902456 0.40665 1.060052
O  4.690065 -0.321772 0.150654
O  1.137175 2.927803 0.059151
O  0.408418 -3.220329 -0.282896
N  0.113253 -0.949405 0.180198
N  -1.771829 -2.331016 -0.436643
N  -3.897668 -1.429809 -0.581884
C  3.526771 0.055471 -0.661631
C  2.471543 -1.073559 -0.771968
C  1.585016 -0.895994 0.492418
C  2.790317 1.15264 0.131106
C  2.006275 2.101743 -0.790758
C  -0.678676 0.165525 0.243323
C  -0.411671 -2.257506 -0.199875
C  -2.043922 0.098683 -0.038123
C  -2.553666 -1.232212 -0.355055
C  -2.905538 1.292141 -0.036331
C  -2.671517 2.414309 0.694744
H  3.854536 0.406167 -1.662945
H  1.861367 -0.950301 -1.683857
H  2.912268 -2.081835 -0.806222
H  1.774069 -1.671874 1.25101
H  3.480055 1.721512 0.773937
H  1.39993 1.531308 -1.527486
H  2.738504 2.727458 -1.343312
H  5.067437 -1.171034 -0.191714
H  -0.172911 1.101985 0.506638
H  0.73651 3.652849 -0.483013
H  -3.777205 1.281343 -0.706638
H  -4.197772 -2.381477 -0.7890
H  -4.589841 -0.70637 -0.409536
H  -1.863095 2.54829 1.417395
